program: Orca
programVersion: 5.0.2
elementType: O O O N C C C C C C C C C C C C C C C C C C C C C C C C H H H H H H H H H H H H H H H H H H H H H H H H H
charge: 0
multiplicity: 1
keywords: wb97x-d3
keywords: def2-TZVPP
keywords: def2/J RIJCOSX
keywords: DEFGRID2
keywords: scfconv7
keywords: smallprint printgap noloewdin
keywords: NOSOSCF
formula: C24H25NO3
InChI: InChI=1/C24H25NO3/c1-16(2)13-20-22(24(20,3)4)23(26)28-21(15-25)17-9-8-12-19(14-17)27-18-10-6-5-7-11-18/h5-14,20-22H,1-4H3
53 atoms
O  -1.114847 1.806478 1.055342
O  -0.4978 2.105634 -1.074672
O  -0.807994 -3.129288 0.463853
N  -3.999188 1.624976 2.675388
C  2.253862 1.234914 0.313802
C  2.296814 2.640225 -0.187154
C  1.137719 2.207974 0.676067
C  1.999311 0.117569 -0.668538
C  3.15381 0.833757 1.457651
C  3.289609 3.622175 0.321782
C  -0.203344 2.053116 0.08701
C  3.046286 4.908034 0.578958
C  1.704409 5.549064 0.39736
C  4.127151 5.822946 1.069914
C  -2.409686 1.45588 0.608206
C  -2.461933 0.05937 0.025973
C  -3.281257 1.552666 1.781914
C  -1.609538 -0.925504 0.503319
C  -3.366823 -0.22756 -0.98347
C  -1.658774 -2.196594 -0.046709
C  -3.425987 -1.510058 -1.506354
C  -2.575273 -2.500465 -1.046737
C  -0.164517 -3.987496 -0.38232
C  0.007297 -5.29465 0.048774
C  0.350054 -3.573684 -1.605423
C  0.700699 -6.191312 -0.749341
C  1.032679 -4.484345 -2.396907
C  1.210228 -5.794396 -1.976675
H  2.039435 2.746426 -1.238782
H  1.14045 2.538993 1.708629
H  1.526872 -0.737385 -0.180226
H  1.367847 0.422441 -1.500527
H  2.947514 -0.228465 -1.083859
H  2.726678 -0.009727 2.002209
H  4.132395 0.523121 1.086073
H  3.31141 1.644145 2.169056
H  4.301714 3.252838 0.461288
H  1.324839 5.933729 1.347363
H  1.780316 6.40756 -0.274207
H  0.959395 4.873294 -0.015853
H  5.077659 5.306012 1.195244
H  4.284168 6.651695 0.375392
H  3.856926 6.268919 2.030179
H  -2.771708 2.170742 -0.139219
H  -0.898958 -0.720632 1.293855
H  -4.021059 0.545197 -1.366562
H  -4.13707 -1.740204 -2.288152
H  -2.621434 -3.497623 -1.464604
H  -0.397299 -5.59827 1.005231
H  0.224312 -2.551261 -1.938725
H  0.834496 -7.209941 -0.410174
H  1.432693 -4.161257 -3.348902
H  1.744771 -6.498774 -2.599149
totalener: -1210.08098908 hartree
nucrepener: 2503.19950218 hartree
electener: -3713.28049127 hartree
oneelecener: -6617.17835020 hartree
twoeener: 2903.89785893 hartree
kineticenergy: 1204.77018087 hartree
xcener: -118.589919583122 hartree
chargesum: -0.0000000
charge: -0.269195 -0.354762 -0.301715 -0.000181 0.139798 -0.004967 -0.135317 -0.265890 -0.270941 -0.248454 0.301623 -0.007701 -0.221561 -0.210679 0.308499 0.087320 -0.253877 -0.236151 -0.159767 0.199702 -0.100391 -0.147002 0.251264 -0.211110 -0.157836 -0.092903 -0.135478 -0.138695 0.108472 0.095621 0.076582 0.102699 0.095743 0.095185 0.092146 0.088125 0.094944 0.089864 0.091766 0.079961 0.078919 0.088309 0.085911 0.125184 0.133499 0.106710 0.129154 0.136020 0.127748 0.133618 0.126606 0.127329 0.126254
qa: -0.2692 -0.3548 -0.3017 -0.0002 0.1398 -0.0050 -0.1353 -0.2659 -0.2709 -0.2485 0.3016 -0.0077 -0.2216 -0.2107 0.3085 0.0873 -0.2539 -0.2362 -0.1598 0.1997 -0.1004 -0.1470 0.2513 -0.2111 -0.1578 -0.0929 -0.1355 -0.1387 0.1085 0.0956 0.0766 0.1027 0.0957 0.0952 0.0921 0.0881 0.0949 0.0899 0.0918 0.0800 0.0789 0.0883 0.0859 0.1252 0.1335 0.1067 0.1292 0.1360 0.1277 0.1336 0.1266 0.1273 0.1263
va: 2.1031 2.1441 2.0922 3.1230 3.7483 3.8209 3.8327 3.8937 3.9036 3.9046 4.2334 3.7439 3.9368 3.9418 3.8230 3.6484 4.0150 4.0281 4.0562 3.8858 3.9534 3.9573 3.7733 4.0454 3.9160 3.9395 3.9792 3.9579 1.0231 1.0294 1.0059 1.0139 1.0059 1.0071 1.0012 1.0049 1.0098 1.0010 1.0023 1.0177 1.0097 0.9987 0.9996 1.0180 1.0244 1.0125 1.0004 1.0015 1.0135 1.0027 0.9987 1.0004 1.0000
dispcorr: -0.027542886 hartree
energy: -1210.108531970794
dipole: 28.39670 -27.09945 1.29725 15.58304 -15.95030 -0.36727 -2.78152 1.72253 -1.05899
magnitude: 1.71441 au
magnitude: 4.35768 debye
