program: Orca
programVersion: 5.0.2
elementType: O O O N C C C C C C C C C C C C C C C C C C C C C C C C H H H H H H H H H H H H H H H H H H H H H H H H H
charge: 0
multiplicity: 1
keywords: wb97x-d3
keywords: def2-TZVPP
keywords: def2/J RIJCOSX
keywords: DEFGRID2
keywords: scfconv7
keywords: smallprint printgap noloewdin
keywords: NOSOSCF
formula: C24H25NO3
InChI: InChI=1/C24H25NO3/c1-16(2)13-20-22(24(20,3)4)23(26)28-21(15-25)17-9-8-12-19(14-17)27-18-10-6-5-7-11-18/h5-14,20-22H,1-4H3
53 atoms
O  -1.119073 1.686267 1.312348
O  -0.762171 2.503045 -0.73977
O  -0.26434 -3.10381 0.157229
N  -3.771447 0.682833 3.02003
C  2.209819 1.917449 0.215119
C  1.958319 3.393233 0.105539
C  0.995627 2.536478 0.890151
C  2.038403 1.06697 -1.020496
C  3.291458 1.407835 1.136739
C  2.776168 4.394628 0.817375
C  -0.356031 2.273951 0.365163
C  3.355107 5.475291 0.289624
C  3.283846 5.864267 -1.155707
C  4.152823 6.41282 1.146273
C  -2.37013 1.186506 0.872625
C  -2.212325 -0.068047 0.042889
C  -3.140027 0.912005 2.088465
C  -1.340347 -1.058899 0.466863
C  -2.934259 -0.222358 -1.13043
C  -1.176605 -2.205744 -0.298256
C  -2.775377 -1.378067 -1.877453
C  -1.897092 -2.371947 -1.476179
C  -0.283447 -4.389364 -0.313717
C  -1.348858 -5.232243 -0.027784
C  0.806354 -4.843652 -1.038462
C  -1.315369 -6.542419 -0.477695
C  0.831999 -6.159733 -1.476912
C  -0.227729 -7.010371 -1.202448
H  1.573525 3.699719 -0.860924
H  1.053158 2.591528 1.972044
H  1.309801 1.470576 -1.719636
H  2.992517 0.990611 -1.544991
H  1.723356 0.054676 -0.758359
H  3.367093 1.978044 2.06129
H  3.101559 0.367822 1.406839
H  4.263955 1.452448 0.643746
H  2.910659 4.227917 1.88223
H  2.851209 6.86162 -1.265767
H  4.286614 5.912688 -1.587311
H  2.698419 5.180413 -1.765859
H  4.18616 6.092865 2.186985
H  5.181632 6.495229 0.786944
H  3.732645 7.421449 1.119799
H  -2.912483 1.94183 0.293956
H  -0.775717 -0.952584 1.384946
H  -3.603124 0.558482 -1.467683
H  -3.328673 -1.503372 -2.798423
H  -1.772189 -3.258792 -2.082724
H  -2.191185 -4.867106 0.545967
H  1.627613 -4.171062 -1.248359
H  -2.142216 -7.203206 -0.253842
H  1.684098 -6.517727 -2.039311
H  -0.205298 -8.035347 -1.546863
totalener: -1210.08272189 hartree
nucrepener: 2443.56007253 hartree
electener: -3653.64279442 hartree
oneelecener: -6498.07441184 hartree
twoeener: 2844.43161742 hartree
kineticenergy: 1204.77057569 hartree
xcener: -118.589166709131 hartree
chargesum: 0.0000000
charge: -0.266903 -0.360497 -0.297374 -0.002818 0.089243 0.042939 -0.082816 -0.255296 -0.242849 -0.190671 0.297354 -0.050275 -0.234940 -0.202534 0.321788 0.078799 -0.258539 -0.264185 -0.146466 0.244287 -0.113604 -0.160291 0.191432 -0.144117 -0.165849 -0.124735 -0.115934 -0.120109 0.089659 0.077093 0.100011 0.090094 0.084770 0.072853 0.093724 0.093024 0.073228 0.087726 0.085443 0.082304 0.077047 0.083573 0.085626 0.122013 0.122086 0.105692 0.127962 0.132296 0.137554 0.125543 0.129638 0.128047 0.127954
qa: -0.2669 -0.3605 -0.2974 -0.0028 0.0892 0.0429 -0.0828 -0.2553 -0.2428 -0.1907 0.2974 -0.0503 -0.2349 -0.2025 0.3218 0.0788 -0.2585 -0.2642 -0.1465 0.2443 -0.1136 -0.1603 0.1914 -0.1441 -0.1658 -0.1247 -0.1159 -0.1201 0.0897 0.0771 0.1000 0.0901 0.0848 0.0729 0.0937 0.0930 0.0732 0.0877 0.0854 0.0823 0.0770 0.0836 0.0856 0.1220 0.1221 0.1057 0.1280 0.1323 0.1376 0.1255 0.1296 0.1280 0.1280
va: 2.1139 2.1439 2.0926 3.1230 3.7491 3.7994 3.8506 3.9128 3.9099 3.9013 4.2932 3.8246 3.9461 3.9356 3.8240 3.6376 4.0302 4.0560 4.0351 3.8262 3.9800 3.9392 3.8568 3.9741 4.0172 3.9457 3.9430 3.9397 1.0344 1.0377 1.0185 1.0023 1.0030 1.0108 1.0043 1.0043 1.0210 0.9991 0.9996 1.0152 1.0124 0.9986 0.9984 1.0186 1.0337 1.0139 1.0013 1.0074 1.0024 1.0100 0.9995 0.9994 0.9997
dispcorr: -0.025390406 hartree
energy: -1210.108112297983
dipole: 29.81730 -28.56522 1.25208 20.01544 -20.45655 -0.44111 -6.87567 5.60980 -1.26587
magnitude: 1.83431 au
magnitude: 4.66245 debye
