program: Orca
programVersion: 5.0.2
elementType: O O O N C C C C C C C C C C C C C C C C C C C C C C C C H H H H H H H H H H H H H H H H H H H H H H H H H
charge: 0
multiplicity: 1
keywords: wb97x-d3
keywords: def2-TZVPP
keywords: def2/J RIJCOSX
keywords: DEFGRID2
keywords: scfconv7
keywords: smallprint printgap noloewdin
keywords: NOSOSCF
formula: C24H25NO3
InChI: InChI=1/C24H25NO3/c1-16(2)13-20-22(24(20,3)4)23(26)28-21(15-25)17-9-8-12-19(14-17)27-18-10-6-5-7-11-18/h5-14,20-22H,1-4H3
53 atoms
O  -1.317445 1.867088 1.120174
O  -0.784795 2.598083 -0.926017
O  -0.227248 -2.865996 0.009725
N  -4.064609 0.856006 2.652667
C  2.078552 1.951989 0.300413
C  1.895305 3.423876 0.082069
C  0.841249 2.663939 0.834856
C  1.970506 1.01896 -0.881199
C  3.061763 1.484353 1.344678
C  2.711251 4.441154 0.794521
C  -0.470726 2.407077 0.215242
C  3.954228 4.786834 0.458056
C  4.695228 4.169473 -0.68832
C  4.704397 5.840254 1.214547
C  -2.526988 1.348946 0.597848
C  -2.302136 0.081797 -0.197277
C  -3.37681 1.080713 1.760789
C  -1.398089 -0.862435 0.2656
C  -3.005314 -0.137268 -1.370908
C  -1.181143 -2.021336 -0.464655
C  -2.795745 -1.308542 -2.081562
C  -1.883877 -2.253734 -1.642077
C  -0.309259 -4.204656 -0.259493
C  0.799102 -4.825197 -0.813006
C  -1.446324 -4.935845 0.05956
C  0.770382 -6.192895 -1.043749
C  -1.465505 -6.299567 -0.184925
C  -0.36095 -6.933224 -0.73714
H  1.599311 3.69151 -0.92951
H  0.816129 2.780083 1.913428
H  2.957394 0.882852 -1.328474
H  1.611278 0.03402 -0.575676
H  1.306065 1.389323 -1.658452
H  3.110809 2.153337 2.202487
H  2.793243 0.489971 1.705303
H  4.066597 1.424429 0.921845
H  2.243716 4.945105 1.635484
H  5.635293 3.727353 -0.34912
H  4.124108 3.393957 -1.195028
H  4.960563 4.92733 -1.429745
H  5.635241 5.440362 1.624311
H  4.983083 6.670611 0.561255
H  4.120678 6.245064 2.040162
H  -3.033993 2.08964 -0.03011
H  -0.847428 -0.708662 1.185363
H  -3.701015 0.605852 -1.738214
H  -3.334957 -1.482345 -3.002982
H  -1.71598 -3.154059 -2.21813
H  1.676448 -4.238641 -1.052046
H  -2.305206 -4.445352 0.499942
H  1.637137 -6.678482 -1.472128
H  -2.349552 -6.870853 0.065375
H  -0.381401 -7.998608 -0.921837
totalener: -1210.08157243 hartree
nucrepener: 2462.79921606 hartree
electener: -3672.88078849 hartree
oneelecener: -6536.55380049 hartree
twoeener: 2863.67301200 hartree
kineticenergy: 1204.77997716 hartree
xcener: -118.590436653529 hartree
chargesum: 0.0000000
charge: -0.268516 -0.354756 -0.302790 -0.002467 0.070700 -0.021201 -0.085934 -0.263297 -0.245601 -0.194194 0.297478 -0.024545 -0.239607 -0.209721 0.319748 0.093697 -0.258350 -0.274867 -0.150126 0.236018 -0.107345 -0.155291 0.206892 -0.186912 -0.146326 -0.104876 -0.123054 -0.128947 0.109405 0.087043 0.087516 0.088564 0.105073 0.085346 0.099186 0.086497 0.090250 0.087672 0.081330 0.098791 0.084173 0.087075 0.080366 0.123954 0.127525 0.105184 0.128222 0.135473 0.125432 0.137152 0.126013 0.129356 0.127591
qa: -0.2685 -0.3548 -0.3028 -0.0025 0.0707 -0.0212 -0.0859 -0.2633 -0.2456 -0.1942 0.2975 -0.0245 -0.2396 -0.2097 0.3197 0.0937 -0.2583 -0.2749 -0.1501 0.2360 -0.1073 -0.1553 0.2069 -0.1869 -0.1463 -0.1049 -0.1231 -0.1289 0.1094 0.0870 0.0875 0.0886 0.1051 0.0853 0.0992 0.0865 0.0902 0.0877 0.0813 0.0988 0.0842 0.0871 0.0804 0.1240 0.1275 0.1052 0.1282 0.1355 0.1254 0.1372 0.1260 0.1294 0.1276
va: 2.1084 2.1499 2.0780 3.1228 3.7436 3.8269 3.8226 3.9016 3.9025 3.8601 4.3043 3.7423 3.9346 3.9386 3.8208 3.6177 4.0273 4.0431 4.0445 3.8074 3.9720 3.9513 3.8440 4.0282 3.9541 3.9426 3.9476 3.9473 1.0241 1.0333 1.0043 1.0068 1.0170 1.0071 1.0064 1.0020 1.0131 0.9995 1.0113 1.0034 0.9991 0.9984 1.0106 1.0176 1.0305 1.0134 1.0010 1.0036 1.0117 1.0027 0.9995 0.9997 0.9997
dispcorr: -0.026840454 hartree
energy: -1210.108412881585
dipole: 33.27086 -31.89690 1.37396 15.04335 -15.53570 -0.49235 -3.78429 2.73494 -1.04934
magnitude: 1.79758 au
magnitude: 4.56909 debye
