program: Orca
programVersion: 5.0.2
elementType: O O O N C C C C C C C C C C C C C C C C C C C C C C C C H H H H H H H H H H H H H H H H H H H H H H H H H
charge: 0
multiplicity: 1
keywords: wb97x-d3
keywords: def2-TZVPP
keywords: def2/J RIJCOSX
keywords: DEFGRID2
keywords: scfconv7
keywords: smallprint printgap noloewdin
keywords: NOSOSCF
formula: C24H25NO3
InChI: InChI=1/C24H25NO3/c1-16(2)13-20-22(24(20,3)4)23(26)28-21(15-25)17-9-8-12-19(14-17)27-18-10-6-5-7-11-18/h5-14,20-22H,1-4H3
53 atoms
O  -1.092746 1.864743 -0.635816
O  0.67728 0.499417 -0.725535
O  -1.95653 -3.792453 0.414133
N  -3.973088 2.043058 -2.244494
C  1.644781 2.37657 1.613615
C  2.366794 2.728745 0.351746
C  0.862215 2.641996 0.333762
C  1.769555 0.974642 2.158144
C  1.487409 3.423843 2.688847
C  3.019624 4.045855 0.130221
C  0.193649 1.545579 -0.388192
C  4.159868 4.438625 0.699141
C  4.929799 3.595596 1.669008
C  4.766833 5.773877 0.391666
C  -1.886577 0.845234 -1.225904
C  -2.288743 -0.196255 -0.209333
C  -3.054142 1.529205 -1.786226
C  -1.923945 -1.518017 -0.413064
C  -2.983282 0.181323 0.931699
C  -2.252982 -2.474152 0.540134
C  -3.312046 -0.782522 1.871018
C  -2.947255 -2.105145 1.685795
C  -0.997578 -4.211883 -0.467521
C  -1.354951 -5.175331 -1.397257
C  0.305539 -3.735608 -0.403392
C  -0.396169 -5.671278 -2.268378
C  1.250845 -4.230831 -1.287459
C  0.906085 -5.198397 -2.220781
H  2.85354 1.88494 -0.132187
H  0.320038 3.581415 0.322778
H  0.863981 0.677459 2.690295
H  1.962342 0.234088 1.385933
H  2.59597 0.934359 2.870695
H  1.377538 4.427388 2.280916
H  0.611838 3.209343 3.303751
H  2.35976 3.432941 3.345155
H  2.534305 4.717006 -0.572566
H  4.459381 2.63378 1.863423
H  5.939088 3.404488 1.296022
H  5.047209 4.113535 2.624175
H  4.886896 6.36923 1.300179
H  5.764361 5.661035 -0.039835
H  4.162215 6.34821 -0.308911
H  -1.351463 0.368233 -2.053655
H  -1.373628 -1.790712 -1.303987
H  -3.268711 1.213869 1.086366
H  -3.856458 -0.502025 2.762658
H  -3.198763 -2.85858 2.420486
H  -2.374968 -5.534855 -1.429243
H  0.578615 -2.980961 0.323189
H  -0.673858 -6.426177 -2.991904
H  2.264893 -3.85679 -1.242328
H  1.649986 -5.582311 -2.905629
totalener: -1210.08262617 hartree
nucrepener: 2472.67477345 hartree
electener: -3682.75739962 hartree
oneelecener: -6556.31319144 hartree
twoeener: 2873.55579183 hartree
kineticenergy: 1204.77785220 hartree
xcener: -118.590645387433 hartree
chargesum: -0.0000000
charge: -0.260137 -0.381756 -0.293841 -0.002480 0.056773 -0.027196 -0.084239 -0.256643 -0.247636 -0.194697 0.340878 -0.018355 -0.248447 -0.208599 0.314260 0.004752 -0.256789 -0.131091 -0.205117 0.250370 -0.086187 -0.203435 0.242569 -0.195378 -0.173730 -0.097918 -0.107786 -0.137176 0.109416 0.087385 0.094238 0.095901 0.083969 0.086456 0.098941 0.085170 0.092241 0.083738 0.099599 0.090619 0.084597 0.087110 0.080765 0.114378 0.115160 0.122676 0.127876 0.127350 0.126142 0.133973 0.126490 0.128117 0.126722
qa: -0.2601 -0.3818 -0.2938 -0.0025 0.0568 -0.0272 -0.0842 -0.2566 -0.2476 -0.1947 0.3409 -0.0184 -0.2484 -0.2086 0.3143 0.0048 -0.2568 -0.1311 -0.2051 0.2504 -0.0862 -0.2034 0.2426 -0.1954 -0.1737 -0.0979 -0.1078 -0.1372 0.1094 0.0874 0.0942 0.0959 0.0840 0.0865 0.0989 0.0852 0.0922 0.0837 0.0996 0.0906 0.0846 0.0871 0.0808 0.1144 0.1152 0.1227 0.1279 0.1274 0.1261 0.1340 0.1265 0.1281 0.1267
va: 2.1316 2.1248 2.1211 3.1222 3.7542 3.8236 3.8275 3.9065 3.9055 3.8668 4.2422 3.7371 3.9354 3.9379 3.8512 3.6753 4.0209 3.9178 4.0371 3.8647 3.9385 4.0311 3.7995 4.0446 3.9758 3.9312 3.9430 3.9540 1.0230 1.0337 1.0028 1.0197 1.0039 1.0072 1.0063 1.0020 1.0131 1.0092 1.0046 0.9981 0.9992 0.9985 1.0106 1.0221 1.0195 1.0176 0.9991 1.0127 1.0127 1.0022 0.9992 0.9995 1.0002
dispcorr: -0.026385772 hartree
energy: -1210.109011942650
dipole: 32.46531 -30.87919 1.58612 21.25103 -21.37780 -0.12677 15.42182 -14.43222 0.98960
magnitude: 1.87381 au
magnitude: 4.76284 debye
