program: Orca
programVersion: 5.0.2
elementType: O O O N C C C C C C C C C C C C C C C C C C C C C C C C H H H H H H H H H H H H H H H H H H H H H H H H H
charge: 0
multiplicity: 1
keywords: wb97x-d3
keywords: def2-TZVPP
keywords: def2/J RIJCOSX
keywords: DEFGRID2
keywords: scfconv7
keywords: smallprint printgap noloewdin
keywords: NOSOSCF
formula: C24H25NO3
InChI: InChI=1/C24H25NO3/c1-16(2)13-20-22(24(20,3)4)23(26)28-21(15-25)17-9-8-12-19(14-17)27-18-10-6-5-7-11-18/h5-14,20-22H,1-4H3
53 atoms
O  -1.43602 1.925716 1.011811
O  -0.651264 2.219273 -1.062498
O  -1.138762 -3.057396 0.639681
N  -4.437127 1.66091 2.394906
C  2.014675 1.470442 0.507187
C  2.020558 2.901787 0.058261
C  0.830648 2.377085 0.815684
C  1.893072 0.382355 -0.531286
C  2.864738 1.07571 1.689892
C  2.891268 3.9252 0.684915
C  -0.454464 2.185512 0.119891
C  4.002776 4.427537 0.145498
C  4.548937 3.999069 -1.182229
C  4.797927 5.484946 0.849401
C  -2.682411 1.540667 0.462369
C  -2.648034 0.142657 -0.114352
C  -3.648178 1.614854 1.561369
C  -1.899164 -0.844653 0.510164
C  -3.367454 -0.1462 -1.262187
C  -1.868256 -2.121471 -0.027056
C  -3.345241 -1.432707 -1.7790
C  -2.59844 -2.426473 -1.170498
C  -0.36934 -3.943504 -0.058488
C  -0.289353 -5.236814 0.436938
C  0.353486 -3.573795 -1.186749
C  0.519352 -6.16442 -0.200326
C  1.151602 -4.515421 -1.818472
C  1.239025 -5.81163 -1.332428
H  1.83339 3.034309 -1.003116
H  0.737147 2.664135 1.857961
H  2.888619 0.082934 -0.864013
H  1.408326 -0.503923 -0.115511
H  1.330909 0.693674 -1.409068
H  2.479994 0.16605 2.15376
H  3.890084 0.880522 1.371083
H  2.905641 1.849736 2.455058
H  2.584642 4.297831 1.658066
H  5.572709 3.632637 -1.073957
H  3.966677 3.209206 -1.651929
H  4.594546 4.842511 -1.875592
H  5.826242 5.15697 1.020046
H  4.857366 6.395754 0.248276
H  4.365372 5.749424 1.813423
H  -3.001004 2.245503 -0.31348
H  -1.331236 -0.637415 1.408534
H  -3.938332 0.628463 -1.757634
H  -3.911618 -1.664011 -2.670872
H  -2.58191 -3.427392 -1.58161
H  -0.856411 -5.505593 1.318391
H  0.298619 -2.562712 -1.570453
H  0.579061 -7.172125 0.188899
H  1.713712 -4.227038 -2.696949
H  1.864668 -6.539597 -1.830566
totalener: -1210.08187919 hartree
nucrepener: 2483.15714596 hartree
electener: -3693.23902516 hartree
oneelecener: -6577.07400530 hartree
twoeener: 2883.83498015 hartree
kineticenergy: 1204.77218161 hartree
xcener: -118.589643211487 hartree
chargesum: -0.0000000
charge: -0.269319 -0.357558 -0.298738 -0.000876 0.138732 -0.008463 -0.123322 -0.278493 -0.233468 -0.199967 0.305957 -0.025421 -0.235086 -0.211196 0.312008 0.079873 -0.253985 -0.240213 -0.148708 0.205004 -0.103077 -0.147039 0.256637 -0.209521 -0.165140 -0.091323 -0.136692 -0.141270 0.100824 0.081484 0.093050 0.079091 0.104647 0.095296 0.089495 0.078283 0.086088 0.085312 0.079837 0.091481 0.084258 0.087375 0.079201 0.124265 0.128841 0.105842 0.129469 0.135922 0.127351 0.133063 0.126514 0.127388 0.126287
qa: -0.2693 -0.3576 -0.2987 -0.0009 0.1387 -0.0085 -0.1233 -0.2785 -0.2335 -0.2000 0.3060 -0.0254 -0.2351 -0.2112 0.3120 0.0799 -0.2540 -0.2402 -0.1487 0.2050 -0.1031 -0.1470 0.2566 -0.2095 -0.1651 -0.0913 -0.1367 -0.1413 0.1008 0.0815 0.0930 0.0791 0.1046 0.0953 0.0895 0.0783 0.0861 0.0853 0.0798 0.0915 0.0843 0.0874 0.0792 0.1243 0.1288 0.1058 0.1295 0.1359 0.1274 0.1331 0.1265 0.1274 0.1263
va: 2.1099 2.1458 2.1008 3.1220 3.7157 3.8028 3.9137 3.9060 3.9027 3.8914 4.2786 3.7541 3.9471 3.9402 3.8257 3.6408 4.0193 4.0239 4.0470 3.8778 3.9564 3.9549 3.7777 4.0381 3.9170 3.9384 3.9840 3.9607 1.0251 1.0382 1.0048 1.0039 1.0148 1.0050 1.0059 1.0082 1.0159 1.0001 1.0117 1.0002 0.9988 0.9976 1.0111 1.0182 1.0287 1.0129 1.0005 1.0013 1.0137 1.0021 0.9986 1.0004 1.0000
dispcorr: -0.026729576 hartree
energy: -1210.108608769674
dipole: 35.89039 -34.25035 1.64005 12.63505 -13.12218 -0.48713 -4.85296 3.78098 -1.07198
magnitude: 2.01896 au
magnitude: 5.13178 debye
