program: Orca
programVersion: 5.0.2
elementType: O O O N C C C C C C C C C C C C C C C C C C C C C C C C H H H H H H H H H H H H H H H H H H H H H H H H H
charge: 0
multiplicity: 1
keywords: wb97x-d3
keywords: def2-TZVPP
keywords: def2/J RIJCOSX
keywords: DEFGRID2
keywords: scfconv7
keywords: smallprint printgap noloewdin
keywords: NOSOSCF
formula: C24H25NO3
InChI: InChI=1/C24H25NO3/c1-16(2)13-20-22(24(20,3)4)23(26)28-21(15-25)17-9-8-12-19(14-17)27-18-10-6-5-7-11-18/h5-14,20-22H,1-4H3
53 atoms
O  -0.697957 0.79336 1.387318
O  -0.829937 2.363534 -0.198877
O  -1.987619 -3.430024 -1.31781
N  -2.822175 -0.39395 3.630152
C  2.151209 1.481643 -0.704047
C  2.109172 2.783708 0.024363
C  1.311524 1.603228 0.557419
C  1.492486 1.391346 -2.059144
C  3.36542 0.591781 -0.585459
C  3.250713 3.321871 0.79347
C  -0.158352 1.659897 0.50564
C  3.296216 4.513405 1.393477
C  2.162366 5.492289 1.412575
C  4.527619 4.961508 2.122384
C  -2.112857 0.683036 1.357721
C  -2.58221 -0.150191 0.188569
C  -2.491959 0.072392 2.634016
C  -2.042035 -1.414776 -0.005391
C  -3.530268 0.35258 -0.687997
C  -2.455149 -2.17186 -1.091965
C  -3.949984 -0.422182 -1.758587
C  -3.411498 -1.679313 -1.970788
C  -0.664984 -3.704664 -1.112856
C  0.338782 -2.857952 -1.567674
C  -0.348906 -4.896406 -0.478503
C  1.664312 -3.215344 -1.377993
C  0.981783 -5.243807 -0.301477
C  1.993186 -4.40476 -0.743902
H  1.48344 3.527573 -0.457624
H  1.71228 1.096052 1.427342
H  2.214395 1.654825 -2.833748
H  1.153673 0.372796 -2.259231
H  0.637439 2.053614 -2.164079
H  3.100846 -0.438212 -0.829497
H  4.146146 0.909976 -1.278614
H  3.792236 0.581813 0.416598
H  4.131249 2.691535 0.865419
H  2.450235 6.43146 0.933222
H  1.262246 5.12709 0.922824
H  1.894247 5.741008 2.442312
H  4.311896 5.15472 3.175997
H  5.325811 4.221928 2.074322
H  4.912547 5.896405 1.707674
H  -2.578847 1.672839 1.310589
H  -1.306111 -1.809303 0.685325
H  -3.930993 1.347175 -0.543963
H  -4.688655 -0.034761 -2.447047
H  -3.724381 -2.284007 -2.811586
H  0.089771 -1.931754 -2.070613
H  -1.143895 -5.543645 -0.132599
H  2.446284 -2.559875 -1.739201
H  1.225826 -6.17435 0.19357
H  3.029844 -4.67711 -0.600291
totalener: -1210.08221958 hartree
nucrepener: 2521.03130301 hartree
electener: -3731.11352260 hartree
oneelecener: -6652.78421961 hartree
twoeener: 2921.67069702 hartree
kineticenergy: 1204.77606312 hartree
xcener: -118.591094183844 hartree
chargesum: -0.0000000
charge: -0.267256 -0.378760 -0.299711 -0.000663 0.112954 -0.036425 -0.043986 -0.245548 -0.269581 -0.184186 0.317594 -0.024305 -0.242887 -0.213536 0.325120 0.033672 -0.260842 -0.162385 -0.134999 0.186932 -0.091976 -0.194297 0.225904 -0.161208 -0.198483 -0.116338 -0.088609 -0.152811 0.098659 0.083433 0.091839 0.069418 0.104555 0.075197 0.102531 0.076395 0.084471 0.088514 0.081922 0.086058 0.086404 0.077133 0.085251 0.119057 0.133539 0.108236 0.127597 0.129934 0.140555 0.128431 0.134467 0.127489 0.125531
qa: -0.2673 -0.3788 -0.2997 -0.0007 0.1130 -0.0364 -0.0440 -0.2455 -0.2696 -0.1842 0.3176 -0.0243 -0.2429 -0.2135 0.3251 0.0337 -0.2608 -0.1624 -0.1350 0.1869 -0.0920 -0.1943 0.2259 -0.1612 -0.1985 -0.1163 -0.0886 -0.1528 0.0987 0.0834 0.0918 0.0694 0.1046 0.0752 0.1025 0.0764 0.0845 0.0885 0.0819 0.0861 0.0864 0.0771 0.0853 0.1191 0.1335 0.1082 0.1276 0.1299 0.1406 0.1284 0.1345 0.1275 0.1255
va: 2.1265 2.1246 2.1093 3.1227 3.7997 3.8502 3.8213 3.8939 3.9173 3.9174 4.2435 3.7809 3.9501 3.9425 3.8407 3.6487 4.0297 3.9440 4.0114 3.8691 3.9538 4.0361 3.8570 3.9363 4.0396 3.9427 3.9390 3.9924 1.0219 1.0341 1.0026 1.0084 1.0204 1.0237 1.0000 1.0100 1.0171 0.9989 1.0173 0.9996 0.9985 1.0113 0.9978 1.0206 1.0196 1.0152 0.9998 1.0105 0.9963 1.0128 0.9945 0.9982 1.0016
dispcorr: -0.026943512 hartree
energy: -1210.109163094299
dipole: 30.20279 -29.01431 1.18848 21.70562 -21.25389 0.45173 -3.94836 2.86027 -1.08809
magnitude: 1.67347 au
magnitude: 4.25362 debye
