program: Orca
programVersion: 5.0.2
elementType: O O O N C C C C C C C C C C C C C C C C C C C C C C C C H H H H H H H H H H H H H H H H H H H H H H H H H
charge: 0
multiplicity: 1
keywords: wb97x-d3
keywords: def2-TZVPP
keywords: def2/J RIJCOSX
keywords: DEFGRID2
keywords: scfconv7
keywords: smallprint printgap noloewdin
keywords: NOSOSCF
formula: C24H25NO3
InChI: InChI=1/C24H25NO3/c1-16(2)13-20-22(24(20,3)4)23(26)28-21(15-25)17-9-8-12-19(14-17)27-18-10-6-5-7-11-18/h5-14,20-22H,1-4H3
53 atoms
O  -0.899013 1.411902 -1.16167
O  -1.224531 2.085916 0.943773
O  -0.899008 -3.455906 0.546072
N  -3.985721 2.853296 -0.993018
C  1.368031 3.774087 0.351298
C  1.729377 2.580411 1.167477
C  0.916279 2.389373 -0.094987
C  0.372029 4.766315 0.899251
C  2.427946 4.406724 -0.519089
C  3.127678 2.083764 1.238191
C  -0.491836 1.970828 0.003141
C  3.51567 0.81191 1.136462
C  2.573645 -0.334064 0.930968
C  4.963322 0.433504 1.226751
C  -2.227454 0.929821 -1.209895
C  -2.482169 -0.252237 -0.296333
C  -3.198167 2.018692 -1.041145
C  -1.547499 -1.284139 -0.305948
C  -3.626391 -0.35061 0.476014
C  -1.770907 -2.416698 0.463584
C  -3.838555 -1.492576 1.236461
C  -2.923153 -2.526032 1.235017
C  0.096267 -3.605366 -0.378293
C  -0.190821 -3.798453 -1.723863
C  1.405559 -3.621019 0.074173
C  0.84966 -3.999092 -2.617034
C  2.438086 -3.83345 -0.827873
C  2.165451 -4.01695 -2.174716
H  1.14827 2.47004 2.080433
H  1.446228 1.991079 -0.952529
H  -0.172677 5.261583 0.093801
H  -0.356992 4.312821 1.565809
H  0.900726 5.537718 1.461867
H  3.004419 5.139567 0.048855
H  3.128404 3.675284 -0.921518
H  1.970547 4.929325 -1.360325
H  3.889957 2.838398 1.41261
H  2.759644 -0.832562 -0.023877
H  2.723558 -1.090105 1.705783
H  1.525997 -0.043869 0.959429
H  5.29048 -0.079665 0.318669
H  5.606596 1.300408 1.3720
H  5.138641 -0.257323 2.05498
H  -2.338874 0.591112 -2.244429
H  -0.649149 -1.197961 -0.90441
H  -4.34785 0.454448 0.5011
H  -4.73024 -1.572301 1.843495
H  -3.083909 -3.415129 1.830089
H  -1.217752 -3.79775 -2.066847
H  1.607069 -3.474477 1.127137
H  0.628305 -4.151065 -3.665187
H  3.460059 -3.851502 -0.472618
H  2.972142 -4.180543 -2.876255
totalener: -1210.07886033 hartree
nucrepener: 2565.07923757 hartree
electener: -3775.15809790 hartree
oneelecener: -6741.18090433 hartree
twoeener: 2966.02280642 hartree
kineticenergy: 1204.77428373 hartree
xcener: -118.593723599815 hartree
chargesum: 0.0000000
charge: -0.280090 -0.353642 -0.295093 -0.000387 0.112205 -0.006148 -0.135552 -0.254387 -0.267709 -0.235952 0.339544 0.006842 -0.235447 -0.215482 0.418850 -0.024132 -0.283838 -0.285283 -0.157736 0.285574 -0.068122 -0.215318 0.280505 -0.184818 -0.239642 -0.105127 -0.106541 -0.127333 0.109054 0.090597 0.090768 0.103572 0.084186 0.090612 0.085888 0.093634 0.094432 0.091353 0.087774 0.085996 0.084280 0.080472 0.087500 0.120058 0.126975 0.119711 0.127925 0.126033 0.132684 0.131746 0.129364 0.131003 0.128638
qa: -0.2801 -0.3536 -0.2951 -0.0004 0.1122 -0.0061 -0.1356 -0.2544 -0.2677 -0.2360 0.3395 0.0068 -0.2354 -0.2155 0.4189 -0.0241 -0.2838 -0.2853 -0.1577 0.2856 -0.0681 -0.2153 0.2805 -0.1848 -0.2396 -0.1051 -0.1065 -0.1273 0.1091 0.0906 0.0908 0.1036 0.0842 0.0906 0.0859 0.0936 0.0944 0.0914 0.0878 0.0860 0.0843 0.0805 0.0875 0.1201 0.1270 0.1197 0.1279 0.1260 0.1327 0.1317 0.1294 0.1310 0.1286
va: 2.0975 2.1439 2.1216 3.1149 3.7558 3.8012 3.8534 3.9089 3.9033 3.9035 4.1677 3.7569 3.9328 3.9391 3.9249 3.8090 4.0594 3.9591 3.9979 3.8111 3.9547 4.0418 3.7585 3.9858 4.0104 3.9333 3.8820 3.9523 1.0231 1.0305 1.0025 1.0204 1.0014 1.0024 1.0053 1.0066 1.0093 0.9983 1.0020 1.0128 0.9990 1.0104 0.9988 0.9856 1.0227 1.0258 0.9999 1.0137 1.0044 1.0093 0.9990 0.9983 0.9989
dispcorr: -0.028556820 hartree
energy: -1210.107417149762
dipole: 28.72361 -27.02798 1.69563 10.74519 -11.83922 -1.09403 3.63290 -4.19827 -0.56537
magnitude: 2.09564 au
magnitude: 5.32669 debye
