program: Orca
programVersion: 5.0.2
elementType: O O O N C C C C C C C C C C C C C C C C C C C C C C C C H H H H H H H H H H H H H H H H H H H H H H H H H
charge: 0
multiplicity: 1
keywords: wb97x-d3
keywords: def2-TZVPP
keywords: def2/J RIJCOSX
keywords: DEFGRID2
keywords: scfconv7
keywords: smallprint printgap noloewdin
keywords: NOSOSCF
formula: C24H25NO3
InChI: InChI=1/C24H25NO3/c1-16(2)13-20-22(24(20,3)4)23(26)28-21(15-25)17-9-8-12-19(14-17)27-18-10-6-5-7-11-18/h5-14,20-22H,1-4H3
53 atoms
O  -1.164851 1.926017 -0.694242
O  0.56642 0.524047 -0.897344
O  -1.887253 -3.73872 0.347751
N  -4.202786 2.129704 -1.989069
C  1.5643 2.293741 1.523511
C  2.35266 2.595594 0.286897
C  0.849828 2.624928 0.218599
C  1.553858 0.88293 2.060157
C  1.458018 3.344637 2.600766
C  3.115207 3.858527 0.104278
C  0.123753 1.57231 -0.513618
C  4.276861 4.139616 0.69529
C  4.958181 3.208966 1.651214
C  4.99914 5.425376 0.429615
C  -2.015394 0.920224 -1.227968
C  -2.317029 -0.142001 -0.197008
C  -3.234629 1.614555 -1.64842
C  -1.957817 -1.456397 -0.448509
C  -2.907511 0.214461 1.008358
C  -2.182944 -2.425645 0.521624
C  -3.137759 -0.762587 1.962569
C  -2.772945 -2.078149 1.729802
C  -0.900537 -4.138822 -0.50949
C  -1.17823 -5.225348 -1.325249
C  0.353179 -3.540109 -0.530247
C  -0.191589 -5.720595 -2.163756
C  1.326394 -4.039252 -1.381844
C  1.06203 -5.129015 -2.198987
H  2.789873 1.720058 -0.18781
H  0.37334 3.599332 0.19748
H  0.604143 0.653774 2.547582
H  1.723204 0.134182 1.289875
H  2.341384 0.771112 2.80839
H  2.308479 3.280934 3.28267
H  1.441336 4.355856 2.196844
H  0.549836 3.198462 3.188038
H  2.696718 4.586086 -0.584759
H  5.111304 3.69145 2.619617
H  4.400899 2.289227 1.818186
H  5.950168 2.936565 1.282236
H  4.453753 6.067821 -0.260532
H  5.159364 5.983925 1.355186
H  5.988147 5.238826 0.003825
H  -1.56668 0.461878 -2.115536
H  -1.488798 -1.715224 -1.388983
H  -3.189894 1.241627 1.200474
H  -3.602367 -0.498523 2.90303
H  -2.945528 -2.842434 2.475865
H  -2.159904 -5.679257 -1.293236
H  0.570735 -2.689739 0.103422
H  -0.409371 -6.570491 -2.796954
H  2.301115 -3.570425 -1.400109
H  1.828272 -5.514104 -2.857977
totalener: -1210.08220479 hartree
nucrepener: 2487.02537271 hartree
electener: -3697.10757750 hartree
oneelecener: -6584.95075225 hartree
twoeener: 2887.84317475 hartree
kineticenergy: 1204.77348483 hartree
xcener: -118.590250838003 hartree
chargesum: -0.0000000
charge: -0.257588 -0.378078 -0.294949 -0.002122 0.060164 -0.025478 -0.077025 -0.254618 -0.247204 -0.196086 0.326492 -0.019816 -0.245787 -0.209298 0.320490 0.024444 -0.258128 -0.156105 -0.210349 0.257769 -0.086765 -0.203759 0.259746 -0.211801 -0.178243 -0.090687 -0.110774 -0.143007 0.109645 0.087377 0.094023 0.090902 0.086018 0.085625 0.086230 0.098401 0.091374 0.089909 0.082637 0.099354 0.080774 0.084591 0.087435 0.114233 0.119849 0.122822 0.128281 0.127707 0.125460 0.136356 0.126076 0.127510 0.125971
qa: -0.2576 -0.3781 -0.2949 -0.0021 0.0602 -0.0255 -0.0770 -0.2546 -0.2472 -0.1961 0.3265 -0.0198 -0.2458 -0.2093 0.3205 0.0244 -0.2581 -0.1561 -0.2103 0.2578 -0.0868 -0.2038 0.2597 -0.2118 -0.1782 -0.0907 -0.1108 -0.1430 0.1096 0.0874 0.0940 0.0909 0.0860 0.0856 0.0862 0.0984 0.0914 0.0899 0.0826 0.0994 0.0808 0.0846 0.0874 0.1142 0.1198 0.1228 0.1283 0.1277 0.1255 0.1364 0.1261 0.1275 0.1260
va: 2.1325 2.1272 2.1232 3.1214 3.7530 3.8231 3.8178 3.9038 3.9049 3.8658 4.2676 3.7387 3.9355 3.9382 3.8439 3.6370 4.0231 3.9354 4.0324 3.8583 3.9311 4.0345 3.7883 4.0455 3.9619 3.9287 3.9509 3.9599 1.0230 1.0332 1.0036 1.0190 1.0046 1.0020 1.0071 1.0062 1.0132 0.9987 1.0094 1.0042 1.0105 0.9992 0.9984 1.0208 1.0168 1.0183 0.9992 1.0126 1.0141 0.9980 0.9989 0.9996 1.0002
dispcorr: -0.026984283 hartree
energy: -1210.109189075255
dipole: 33.03568 -31.38916 1.64653 19.38230 -19.50554 -0.12324 15.30951 -14.35543 0.95408
magnitude: 1.90696 au
magnitude: 4.84711 debye
