program: Orca
programVersion: 5.0.2
elementType: O O O N C C C C C C C C C C C C C C C C C C C C C C C C H H H H H H H H H H H H H H H H H H H H H H H H H
charge: 0
multiplicity: 1
keywords: wb97x-d3
keywords: def2-TZVPP
keywords: def2/J RIJCOSX
keywords: DEFGRID2
keywords: scfconv7
keywords: smallprint printgap noloewdin
keywords: NOSOSCF
formula: C24H25NO3
InChI: InChI=1/C24H25NO3/c1-16(2)13-20-22(24(20,3)4)23(26)28-21(15-25)17-9-8-12-19(14-17)27-18-10-6-5-7-11-18/h5-14,20-22H,1-4H3
53 atoms
O  -1.300636 1.897158 -0.465195
O  0.37474 0.546702 -1.081347
O  -1.912917 -3.697481 0.257608
N  -4.323935 2.471386 -1.669242
C  1.754578 1.90832 1.389811
C  2.30577 2.480466 0.122382
C  0.811884 2.439936 0.3171
C  1.875829 0.424042 1.635681
C  1.813525 2.731167 2.653405
C  2.994086 3.796531 0.062788
C  -0.009131 1.516989 -0.485501
C  4.222024 4.03479 0.525113
C  5.066896 2.991311 1.189811
C  4.854635 5.387781 0.403644
C  -2.233723 1.01727 -1.083733
C  -2.591142 -0.121617 -0.15911
C  -3.400152 1.842269 -1.406024
C  -2.088459 -1.387005 -0.423913
C  -3.362831 0.109808 0.972561
C  -2.350752 -2.427625 0.459547
C  -3.632601 -0.939537 1.835029
C  -3.12489 -2.204997 1.590242
C  -0.760539 -3.931005 -0.441002
C  -0.787743 -4.931504 -1.400197
C  0.413414 -3.238575 -0.172625
C  0.371603 -5.243186 -2.094279
C  1.560922 -3.551346 -0.883132
C  1.547158 -4.552109 -1.844051
H  2.668656 1.735444 -0.582179
H  0.324599 3.376307 0.56632
H  1.914775 -0.1558 0.716665
H  2.791336 0.22172 2.195009
H  1.0402 0.055563 2.233916
H  2.762976 2.575449 3.168729
H  1.72099 3.798161 2.459323
H  1.014301 2.439792 3.336212
H  2.454593 4.607824 -0.417317
H  5.333942 3.297706 2.204427
H  4.576434 2.02184 1.249603
H  6.008011 2.856635 0.650767
H  5.778156 5.338837 -0.178371
H  4.193725 6.1084 -0.076161
H  5.127145 5.782154 1.385765
H  -1.830863 0.624567 -2.022597
H  -1.48149 -1.551758 -1.304546
H  -3.759751 1.096087 1.176004
H  -4.239676 -0.77131 2.714301
H  -3.32755 -3.025142 2.266346
H  -1.711463 -5.460997 -1.593375
H  0.433297 -2.45821 0.57729
H  0.349747 -6.025845 -2.840935
H  2.47316 -3.006732 -0.679349
H  2.447396 -4.791758 -2.393154
totalener: -1210.08255168 hartree
nucrepener: 2504.45755595 hartree
electener: -3714.54010763 hartree
oneelecener: -6619.78505181 hartree
twoeener: 2905.24494418 hartree
kineticenergy: 1204.77803795 hartree
xcener: -118.591362705204 hartree
chargesum: -0.0000000
charge: -0.255356 -0.387806 -0.296713 -0.003682 0.068174 -0.023219 -0.094342 -0.271367 -0.249590 -0.198031 0.357967 -0.017382 -0.247598 -0.208974 0.317977 0.002566 -0.260814 -0.151042 -0.181586 0.239194 -0.092340 -0.201080 0.240107 -0.202500 -0.155653 -0.096203 -0.102372 -0.138976 0.110522 0.088166 0.085669 0.087096 0.099557 0.085015 0.087316 0.100839 0.092502 0.090065 0.082976 0.099862 0.087439 0.081358 0.084720 0.117387 0.127997 0.121584 0.128458 0.128345 0.125933 0.125804 0.125902 0.120507 0.125623
qa: -0.2554 -0.3878 -0.2967 -0.0037 0.0682 -0.0232 -0.0943 -0.2714 -0.2496 -0.1980 0.3580 -0.0174 -0.2476 -0.2090 0.3180 0.0026 -0.2608 -0.1510 -0.1816 0.2392 -0.0923 -0.2011 0.2401 -0.2025 -0.1557 -0.0962 -0.1024 -0.1390 0.1105 0.0882 0.0857 0.0871 0.0996 0.0850 0.0873 0.1008 0.0925 0.0901 0.0830 0.0999 0.0874 0.0814 0.0847 0.1174 0.1280 0.1216 0.1285 0.1283 0.1259 0.1258 0.1259 0.1205 0.1256
va: 2.1345 2.1111 2.1207 3.1203 3.7276 3.8164 3.8453 3.9096 3.9070 3.8699 4.2247 3.7380 3.9360 3.9377 3.8371 3.6585 4.0255 3.9089 4.0427 3.8628 3.9420 4.0394 3.8297 4.0357 3.9569 3.9343 3.9565 3.9674 1.0223 1.0333 1.0192 1.0060 0.9995 1.0018 1.0071 1.0058 1.0132 0.9985 1.0089 1.0047 0.9985 1.0105 0.9990 1.0193 1.0204 1.0161 0.9997 1.0123 1.0135 0.9999 0.9990 1.0018 1.0004
dispcorr: -0.027465591 hartree
energy: -1210.110017268823
dipole: 35.05370 -33.36380 1.68990 16.82720 -17.08308 -0.25588 13.61066 -12.69177 0.91889
magnitude: 1.94052 au
magnitude: 4.93240 debye
