program: Orca
programVersion: 5.0.2
elementType: O O O N C C C C C C C C C C C C C C C C C C C C C C C C H H H H H H H H H H H H H H H H H H H H H H H H H
charge: 0
multiplicity: 1
keywords: wb97x-d3
keywords: def2-TZVPP
keywords: def2/J RIJCOSX
keywords: DEFGRID2
keywords: scfconv7
keywords: smallprint printgap noloewdin
keywords: NOSOSCF
formula: C24H25NO3
InChI: InChI=1/C24H25NO3/c1-16(2)13-20-22(24(20,3)4)23(26)28-21(15-25)17-9-8-12-19(14-17)27-18-10-6-5-7-11-18/h5-14,20-22H,1-4H3
53 atoms
O  -1.087266 1.958949 -0.551304
O  0.60035 0.49171 -0.570418
O  -2.058407 -3.718887 0.089789
N  -3.92356 2.33471 -2.212907
C  1.431759 2.239088 1.934633
C  2.337246 2.502267 0.768304
C  0.841734 2.582189 0.575608
C  1.333398 0.832503 2.473464
C  1.285549 3.293607 3.004541
C  3.14881 3.732351 0.650038
C  0.157649 1.555465 -0.231578
C  4.476345 3.794674 0.528761
C  5.3823 2.601179 0.514383
C  5.17655 5.113629 0.392674
C  -1.895512 1.009335 -1.234081
C  -2.361357 -0.090989 -0.310535
C  -3.026741 1.767997 -1.772828
C  -1.993761 -1.39894 -0.581157
C  -3.110833 0.215949 0.817594
C  -2.364877 -2.411845 0.294417
C  -3.487914 -0.804166 1.675436
C  -3.113292 -2.114381 1.425538
C  -0.951492 -4.073709 -0.630977
C  0.287959 -3.480308 -0.424654
C  -1.098231 -5.100644 -1.551316
C  1.378463 -3.919683 -1.158797
C  0.004551 -5.53878 -2.268576
C  1.244599 -4.947585 -2.080953
H  2.778209 1.606933 0.343203
H  0.405424 3.572602 0.502471
H  0.347797 0.646597 2.904615
H  1.514984 0.073273 1.716452
H  2.07125 0.692674 3.265484
H  0.349115 3.160275 3.548424
H  2.103269 3.21904 3.723373
H  1.294695 4.307072 2.606305
H  2.601732 4.670717 0.655782
H  6.117745 2.671697 1.319734
H  4.858899 1.655042 0.633492
H  5.948644 2.555898 -0.419397
H  4.481941 5.952484 0.410084
H  5.901083 5.260065 1.197635
H  5.737823 5.164347 -0.543747
H  -1.350554 0.576829 -2.079798
H  -1.400853 -1.618577 -1.459349
H  -3.400972 1.238026 1.024864
H  -4.075244 -0.578533 2.555292
H  -3.398602 -2.911304 2.099453
H  0.404688 -2.675489 0.289843
H  -2.071053 -5.551526 -1.696792
H  2.341249 -3.451423 -1.004055
H  -0.112139 -6.341473 -2.984589
H  2.101132 -5.285197 -2.648358
totalener: -1210.08334154 hartree
nucrepener: 2481.16198934 hartree
electener: -3691.24533088 hartree
oneelecener: -6573.21188584 hartree
twoeener: 2881.96655496 hartree
kineticenergy: 1204.76854571 hartree
xcener: -118.590142287077 hartree
chargesum: 0.0000000
charge: -0.255708 -0.382092 -0.295610 -0.002441 0.100782 0.034593 -0.108237 -0.252859 -0.236799 -0.195293 0.336587 -0.040249 -0.236482 -0.205540 0.313042 0.025134 -0.256567 -0.151959 -0.207671 0.252874 -0.084448 -0.204815 0.257228 -0.175006 -0.211391 -0.110026 -0.090253 -0.143665 0.090493 0.078347 0.090180 0.085913 0.089656 0.092351 0.092598 0.073334 0.077009 0.085480 0.081113 0.089068 0.078283 0.084172 0.086324 0.115098 0.119247 0.122621 0.128349 0.127942 0.134683 0.125780 0.127028 0.125977 0.125827
qa: -0.2557 -0.3821 -0.2956 -0.0024 0.1008 0.0346 -0.1082 -0.2529 -0.2368 -0.1953 0.3366 -0.0402 -0.2365 -0.2055 0.3130 0.0251 -0.2566 -0.1520 -0.2077 0.2529 -0.0844 -0.2048 0.2572 -0.1750 -0.2114 -0.1100 -0.0903 -0.1437 0.0905 0.0783 0.0902 0.0859 0.0897 0.0924 0.0926 0.0733 0.0770 0.0855 0.0811 0.0891 0.0783 0.0842 0.0863 0.1151 0.1192 0.1226 0.1283 0.1279 0.1347 0.1258 0.1270 0.1260 0.1258
va: 2.1374 2.1225 2.1229 3.1213 3.7456 3.7845 3.8989 3.9143 3.9087 3.9001 4.2415 3.8065 3.9482 3.9371 3.8505 3.6322 4.0205 3.9280 4.0369 3.8625 3.9315 4.0373 3.7914 3.9587 4.0433 3.9506 3.9280 3.9606 1.0323 1.0384 1.0032 1.0194 1.0031 1.0048 1.0050 1.0105 1.0194 1.0002 1.0137 0.9991 1.0118 0.9987 0.9981 1.0199 1.0169 1.0176 0.9991 1.0124 0.9992 1.0140 0.9999 0.9989 1.0003
dispcorr: -0.025816408 hartree
energy: -1210.109157944747
dipole: 33.21771 -31.67886 1.53885 17.48790 -17.70483 -0.21693 14.80025 -13.81855 0.98171
magnitude: 1.83817 au
magnitude: 4.67225 debye
