program: Orca
programVersion: 5.0.2
elementType: O O O N C C C C C C C C C C C C C C C C C C C C C C C C H H H H H H H H H H H H H H H H H H H H H H H H H
charge: 0
multiplicity: 1
keywords: wb97x-d3
keywords: def2-TZVPP
keywords: def2/J RIJCOSX
keywords: DEFGRID2
keywords: scfconv7
keywords: smallprint printgap noloewdin
keywords: NOSOSCF
formula: C24H25NO3
InChI: InChI=1/C24H25NO3/c1-16(2)13-20-22(24(20,3)4)23(26)28-21(15-25)17-9-8-12-19(14-17)27-18-10-6-5-7-11-18/h5-14,20-22H,1-4H3
53 atoms
O  -1.293149 1.845966 -1.113381
O  -1.187507 1.670986 1.109999
O  -1.007971 -3.198066 -0.782671
N  -4.218279 3.138192 0.051055
C  1.540621 3.147769 0.868238
C  1.823814 1.686797 0.754954
C  0.764017 2.310202 -0.134311
C  0.883187 3.683808 2.115814
C  2.522821 4.116876 0.251146
C  3.109977 1.182069 0.213298
C  -0.641789 1.922743 0.073264
C  3.306625 0.391989 -0.843728
C  2.224208 -0.15212 -1.722613
C  4.689551 -0.035768 -1.233287
C  -2.632503 1.390029 -1.074146
C  -2.77559 -0.016009 -0.524989
C  -3.501953 2.363139 -0.402026
C  -1.845471 -0.968549 -0.918513
C  -3.814278 -0.375184 0.321631
C  -1.935117 -2.260635 -0.4257
C  -3.91695 -1.682036 0.772151
C  -2.971882 -2.629769 0.415421
C  0.266345 -3.077912 -0.310993
C  0.627599 -2.215511 0.717811
C  1.218954 -3.898012 -0.905236
C  1.949233 -2.179367 1.138968
C  2.531653 -3.853719 -0.46641
C  2.907464 -2.991897 0.55524
H  1.408918 1.096173 1.570088
H  1.037669 2.466015 -1.171073
H  0.228524 2.963972 2.598589
H  1.654071 3.969733 2.833898
H  0.293742 4.575329 1.895175
H  2.024905 5.051081 -0.012605
H  3.318878 4.355925 0.958807
H  2.991267 3.717965 -0.648328
H  3.984547 1.488331 0.782306
H  2.325701 0.229264 -2.742437
H  2.302982 -1.239604 -1.783886
H  1.225464 0.082572 -1.367946
H  5.452967 0.386318 -0.580827
H  4.776363 -1.124628 -1.199431
H  4.919784 0.263618 -2.25875
H  -2.936061 1.388237 -2.125334
H  -1.033575 -0.71482 -1.589571
H  -4.537815 0.360245 0.646774
H  -4.728546 -1.956637 1.432085
H  -3.02918 -3.644827 0.785066
H  -0.101415 -1.571686 1.19233
H  0.922372 -4.567103 -1.702338
H  2.228202 -1.501202 1.934112
H  3.266653 -4.497872 -0.931349
H  3.934012 -2.954652 0.893394
totalener: -1210.07800466 hartree
nucrepener: 2652.56336058 hartree
electener: -3862.64136524 hartree
oneelecener: -6916.06919624 hartree
twoeener: 3053.42783101 hartree
kineticenergy: 1204.77700176 hartree
xcener: -118.598762151484 hartree
chargesum: -0.0000000
charge: -0.283042 -0.362079 -0.300920 0.002898 0.103152 -0.006272 -0.060823 -0.252850 -0.260854 -0.270280 0.297775 0.023127 -0.197802 -0.212696 0.427346 -0.028986 -0.289334 -0.255558 -0.123760 0.198817 -0.097070 -0.158816 0.279151 -0.172727 -0.216754 -0.098298 -0.080496 -0.199736 0.086055 0.098912 0.102364 0.082531 0.090175 0.096164 0.089126 0.085107 0.091277 0.108986 0.096076 0.030447 0.079512 0.083614 0.089354 0.123483 0.155366 0.120178 0.130953 0.128259 0.131682 0.122236 0.122579 0.124468 0.127985
qa: -0.2830 -0.3621 -0.3009 0.0029 0.1032 -0.0063 -0.0608 -0.2528 -0.2609 -0.2703 0.2978 0.0231 -0.1978 -0.2127 0.4273 -0.0290 -0.2893 -0.2556 -0.1238 0.1988 -0.0971 -0.1588 0.2792 -0.1727 -0.2168 -0.0983 -0.0805 -0.1997 0.0861 0.0989 0.1024 0.0825 0.0902 0.0962 0.0891 0.0851 0.0913 0.1090 0.0961 0.0304 0.0795 0.0836 0.0894 0.1235 0.1554 0.1202 0.1310 0.1283 0.1317 0.1222 0.1226 0.1245 0.1280
va: 2.1043 2.1258 2.1111 3.1129 3.8350 3.7835 3.8295 3.9010 3.9005 3.8421 4.1756 3.7529 3.9111 3.9334 3.9168 3.7482 4.0657 4.0256 3.9716 3.8686 3.9540 4.0447 3.7724 3.8342 4.0110 3.8880 3.9076 3.9349 1.0240 1.0264 1.0228 1.0009 1.0029 1.0056 1.0039 1.0076 1.0145 1.0061 1.0035 1.0224 1.0100 1.0014 1.0012 0.9858 0.9989 1.0254 1.0001 1.0085 1.0170 1.0166 1.0009 0.9991 1.0009
dispcorr: -0.033237055 hartree
energy: -1210.111241713158
dipole: 30.29959 -28.90799 1.39160 7.60924 -8.34221 -0.73297 0.78821 -1.41977 -0.63156
magnitude: 1.69489 au
magnitude: 4.30808 debye
