program: Orca
programVersion: 5.0.2
elementType: Cl Cl O O O N C C C C C C C C C C C C C C C C C C C C C C H H H H H H H H H H H H H H H H H H H
charge: 0
multiplicity: 1
keywords: wb97x-d3
keywords: def2-TZVPP
keywords: def2/J RIJCOSX
keywords: DEFGRID2
keywords: scfconv7
keywords: smallprint printgap noloewdin
keywords: NOSOSCF
formula: C22H19Cl2NO3
InChI: InChI=1/C22H19Cl2NO3/c1-22(2)17(12-19(23)24)20(22)21(26)28-18(13-25)14-7-6-10-16(11-14)27-15-8-4-3-5-9-15/h3-12,17-18,20H,1-2H3
47 atoms
Cl -0.781167 0.291398 2.523983
Cl -3.584737 0.701359 3.090052
O  1.506478 1.38144 -0.497203
O  2.154424 3.100974 0.781038
O  0.81237 -3.613087 -0.844753
N  3.56279 1.1243 -3.108282
C  -1.067702 3.072792 -0.863139
C  -1.251392 1.843187 -0.044921
C  -0.152745 2.816356 0.32856
C  -0.55466 2.936323 -2.275371
C  -2.03177 4.22006 -0.688904
C  -2.389188 1.658497 0.88196
C  1.277139 2.477261 0.235752
C  -2.27489 0.976046 2.012025
C  2.819412 0.857094 -0.613726
C  2.789109 -0.595958 -0.210552
C  3.225261 1.012183 -2.014129
C  1.823144 -1.427674 -0.764371
C  3.688459 -1.078835 0.727277
C  1.742247 -2.744819 -0.341771
C  3.616027 -2.411018 1.113875
C  2.640151 -3.244792 0.594139
C  -0.429858 -3.132348 -1.194332
C  -1.156855 -2.312517 -0.339822
C  -0.953953 -3.535109 -2.411989
C  -2.418965 -1.884396 -0.723707
C  -2.224069 -3.109407 -2.778511
C  -2.957081 -2.279198 -1.942651
H  -0.915123 0.919928 -0.50962
H  -0.351906 3.456068 1.180953
H  -1.399508 2.872093 -2.963032
H  0.05533 2.048678 -2.430631
H  0.035275 3.80891 -2.560109
H  -2.920567 4.064587 -1.303156
H  -1.569403 5.156081 -1.004966
H  -2.355906 4.344297 0.344539
H  -3.36088 2.063543 0.622961
H  3.534785 1.407483 0.003526
H  1.136766 -1.04747 -1.511605
H  4.433725 -0.422275 1.157189
H  4.312951 -2.798211 1.844679
H  2.570469 -4.276721 0.913083
H  -0.747867 -2.009039 0.615351
H  -0.376074 -4.175486 -3.065917
H  -2.985428 -1.245009 -0.058529
H  -2.635498 -3.423747 -3.728548
H  -3.942507 -1.94378 -2.236611
elementType: Cl O N C H
totalener: -2050.66805310 hartree
nucrepener: 2948.19976188 hartree
electener: -4998.86781498 hartree
oneelecener: -8671.12924615 hartree
twoeener: 3672.26143117 hartree
cpcmener: -0.03610333 hartree
kineticenergy: 2044.46678006 hartree
xcener: -151.864429742399 hartree
chargesum: 0.0000000
charge: -0.059463 -0.060405 -0.259466 -0.466581 -0.340786 -0.098513 0.147647 -0.005031 -0.154976 -0.268439 -0.289320 -0.250679 0.428042 0.105583 0.387990 0.015857 -0.212565 -0.205248 -0.195377 0.251319 -0.114514 -0.232008 0.270028 -0.186846 -0.241853 -0.146603 -0.125061 -0.186082 0.108794 0.110302 0.098511 0.086899 0.104169 0.102466 0.100226 0.094141 0.145141 0.129604 0.153406 0.152432 0.162271 0.150535 0.152952 0.148100 0.171212 0.161523 0.160665
qa: -0.0595 -0.0604 -0.2595 -0.4666 -0.3408 -0.0985 0.1476 -0.0050 -0.1550 -0.2684 -0.2893 -0.2507 0.4280 0.1056 0.3880 0.0159 -0.2126 -0.2052 -0.1954 0.2513 -0.1145 -0.2320 0.2700 -0.1868 -0.2419 -0.1466 -0.1251 -0.1861 0.1088 0.1103 0.0985 0.0869 0.1042 0.1025 0.1002 0.0941 0.1451 0.1296 0.1534 0.1524 0.1623 0.1505 0.1530 0.1481 0.1712 0.1615 0.1607
va: 1.2714 1.2431 2.1265 2.0431 2.0703 3.1050 3.7445 3.8330 3.8686 3.8967 3.9207 3.8739 4.1490 4.1290 3.7243 3.6955 4.0734 3.9226 3.9422 3.7630 3.8913 4.0086 3.7348 3.8884 4.0106 3.8395 3.8780 3.9218 0.9988 1.0225 1.0018 1.0098 0.9996 0.9988 1.0022 0.9993 1.0082 1.0431 1.0081 0.9986 0.9880 1.0044 1.0128 1.0063 0.9830 0.9871 0.9904
dispcorr: -0.029355901 hartree
energy: -2050.697408998346
dipole: -1.22935 -0.49880 -1.72815 6.83214 -6.86173 -0.02959 -21.19025 21.56018 0.36993
magnitude: 1.76755 au
magnitude: 4.49274 debye
