program: Orca
programVersion: 5.0.2
elementType: Cl Cl O O O N C C C C C C C C C C C C C C C C C C C C C C H H H H H H H H H H H H H H H H H H H
charge: 0
multiplicity: 1
keywords: wb97x-d3
keywords: def2-TZVPP
keywords: def2/J RIJCOSX
keywords: DEFGRID2
keywords: scfconv7
keywords: smallprint printgap noloewdin
keywords: NOSOSCF
formula: C22H19Cl2NO3
InChI: InChI=1/C22H19Cl2NO3/c1-22(2)17(12-19(23)24)20(22)21(26)28-18(13-25)14-7-6-10-16(11-14)27-15-8-4-3-5-9-15/h3-12,17-18,20H,1-2H3
47 atoms
Cl -0.817529 6.09803 -1.023643
Cl -3.541845 5.753985 -1.905478
O  0.429153 -0.037134 -1.142317
O  1.51586 1.675626 -0.202703
O  1.443347 -3.918411 2.222728
N  1.197457 -2.361441 -3.355359
C  -1.296996 2.160145 1.130765
C  -1.078518 3.130362 0.008607
C  -0.882002 1.643769 -0.234493
C  -0.318656 2.182839 2.278826
C  -2.699603 1.809766 1.564409
C  -2.19366 3.803382 -0.666311
C  0.475712 1.142994 -0.499786
C  -2.176494 5.046656 -1.128967
C  1.680634 -0.648607 -1.441428
C  2.2815 -1.339104 -0.242234
C  1.390181 -1.608885 -2.507334
C  1.553043 -2.328752 0.408757
C  3.540373 -0.971208 0.207506
C  2.110138 -2.962846 1.508824
C  4.079004 -1.608883 1.31671
C  3.37339 -2.606821 1.966969
C  0.568675 -4.768861 1.58697
C  -0.661212 -4.983558 2.189515
C  0.921341 -5.440706 0.423023
C  -1.547968 -5.888729 1.622193
C  0.020454 -6.333483 -0.139033
C  -1.214392 -6.561691 0.455179
H  -0.158815 3.699661 0.080182
H  -1.66515 1.137526 -0.786771
H  -0.185757 1.182611 2.694536
H  -0.712964 2.819443 3.072596
H  0.659691 2.572452 2.007699
H  -3.387079 1.676041 0.730515
H  -3.102318 2.589587 2.212925
H  -2.69184 0.878077 2.131909
H  -3.111002 3.245174 -0.809374
H  2.386463 0.080599 -1.852341
H  0.563855 -2.599755 0.057841
H  4.097664 -0.197137 -0.303401
H  5.060247 -1.330106 1.676243
H  3.794501 -3.108892 2.828577
H  -0.919399 -4.453256 3.097312
H  1.886972 -5.278095 -0.039513
H  -2.506783 -6.0597 2.09374
H  0.292583 -6.859011 -1.044998
H  -1.909431 -7.262664 0.012813
elementType: Cl O N C H
totalener: -2050.67331938 hartree
nucrepener: 2707.23650522 hartree
electener: -4757.90982461 hartree
oneelecener: -8190.00307050 hartree
twoeener: 3432.09324590 hartree
cpcmener: -0.03624282 hartree
kineticenergy: 2044.44996003 hartree
xcener: -151.860264439009 hartree
chargesum: 0.0000000
charge: -0.056903 -0.061241 -0.287944 -0.466676 -0.338889 -0.101907 0.089031 0.032470 -0.077258 -0.268505 -0.269781 -0.200628 0.409357 0.040157 0.433950 0.011544 -0.225927 -0.198618 -0.201255 0.249001 -0.116050 -0.235459 0.276618 -0.244372 -0.187594 -0.128413 -0.146529 -0.184152 0.079191 0.101631 0.102260 0.099930 0.093873 0.094366 0.102306 0.098981 0.132294 0.144337 0.147541 0.149556 0.162124 0.151218 0.149658 0.159513 0.161859 0.163180 0.162156
qa: -0.0569 -0.0612 -0.2879 -0.4667 -0.3389 -0.1019 0.0890 0.0325 -0.0773 -0.2685 -0.2698 -0.2006 0.4094 0.0402 0.4339 0.0115 -0.2259 -0.1986 -0.2013 0.2490 -0.1160 -0.2355 0.2766 -0.2444 -0.1876 -0.1284 -0.1465 -0.1842 0.0792 0.1016 0.1023 0.0999 0.0939 0.0944 0.1023 0.0990 0.1323 0.1443 0.1475 0.1496 0.1621 0.1512 0.1497 0.1595 0.1619 0.1632 0.1622
va: 1.2687 1.2437 2.1343 2.0448 2.0668 3.1088 3.7341 3.8761 3.8493 3.9055 3.9106 3.8991 4.1696 4.2102 3.7087 3.5975 4.0825 3.9427 3.9559 3.7528 3.8999 4.0060 3.6822 4.0090 3.9123 3.8794 3.8845 3.8963 1.0477 1.0315 0.9989 1.0001 1.0175 1.0053 1.0004 1.0011 1.0183 1.0147 1.0149 1.0050 0.9882 1.0042 1.0063 0.9959 0.9880 0.9888 0.9890
dispcorr: -0.023378199 hartree
energy: -2050.696697580956
dipole: 4.03405 -4.55690 -0.52285 -32.42254 32.06120 -0.36133 20.71829 -19.23021 1.48809
magnitude: 1.61813 au
magnitude: 4.11296 debye
