program: Orca
programVersion: 5.0.2
elementType: Cl Cl O O O N C C C C C C C C C C C C C C C C C C C C C C H H H H H H H H H H H H H H H H H H H
charge: 0
multiplicity: 1
keywords: wb97x-d3
keywords: def2-TZVPP
keywords: def2/J RIJCOSX
keywords: DEFGRID2
keywords: scfconv7
keywords: smallprint printgap noloewdin
keywords: NOSOSCF
formula: C22H19Cl2NO3
InChI: InChI=1/C22H19Cl2NO3/c1-22(2)17(12-19(23)24)20(22)21(26)28-18(13-25)14-7-6-10-16(11-14)27-15-8-4-3-5-9-15/h3-12,17-18,20H,1-2H3
47 atoms
Cl -1.098416 6.039438 -1.828507
Cl -3.929839 5.499562 -1.941961
O  0.26364 0.00272 -0.837684
O  1.572143 1.7829 -0.482897
O  1.504745 -4.06677 2.342666
N  0.494675 -2.497843 -2.990927
C  -0.825053 2.801475 1.23558
C  -0.946232 3.389016 -0.138353
C  -0.768466 1.887838 0.026184
C  0.414979 3.129316 2.029966
C  -2.053147 2.662348 2.103185
C  -2.224598 3.882586 -0.662079
C  0.482126 1.269128 -0.439526
C  -2.384043 4.984864 -1.382863
C  1.397404 -0.742526 -1.278588
C  2.091386 -1.421953 -0.125337
C  0.873744 -1.72083 -2.232857
C  1.446933 -2.45093 0.55273
C  3.349655 -0.991837 0.270694
C  2.088296 -3.06561 1.617104
C  3.968819 -1.603717 1.351921
C  3.34828 -2.643909 2.023243
C  0.710357 -4.99801 1.716197
C  -0.456239 -5.372975 2.365131
C  1.082725 -5.592498 0.516879
C  -1.257655 -6.36016 1.808318
C  0.26533 -6.569135 -0.03344
C  -0.905064 -6.956899 0.606136
H  -0.061697 3.912361 -0.482803
H  -1.655001 1.284785 -0.131178
H  0.203145 3.977941 2.682736
H  1.267262 3.400513 1.412049
H  0.703739 2.290146 2.664919
H  -1.863852 1.947353 2.905061
H  -2.929272 2.314638 1.557821
H  -2.301036 3.61924 2.565432
H  -3.116684 3.306312 -0.447978
H  2.101349 -0.106701 -1.822927
H  0.457438 -2.773473 0.24927
H  3.845461 -0.190776 -0.261378
H  4.949477 -1.275415 1.668465
H  3.835603 -3.130262 2.858517
H  -0.729709 -4.90213 3.300554
H  1.9994 -5.306872 0.0165
H  -2.165613 -6.65658 2.316671
H  0.552713 -7.033373 -0.967519
H  -1.534838 -7.721557 0.171749
elementType: Cl O N C H
totalener: -2050.67281870 hartree
nucrepener: 2683.71720551 hartree
electener: -4734.39002421 hartree
oneelecener: -8142.97412639 hartree
twoeener: 3408.58410217 hartree
cpcmener: -0.03519348 hartree
kineticenergy: 2044.45362442 hartree
xcener: -151.860700052202 hartree
chargesum: -0.0000000
charge: -0.056977 -0.060748 -0.287802 -0.472070 -0.339060 -0.102622 0.094098 0.031273 -0.089357 -0.273020 -0.266201 -0.200090 0.423613 0.039847 0.435352 0.007286 -0.225645 -0.187226 -0.188017 0.237653 -0.122372 -0.228952 0.277344 -0.248010 -0.186303 -0.126483 -0.147659 -0.186924 0.082699 0.099438 0.098867 0.093983 0.102963 0.099140 0.094036 0.101398 0.133360 0.139591 0.145591 0.148422 0.161741 0.150869 0.150118 0.159234 0.161873 0.163368 0.162382
qa: -0.0570 -0.0607 -0.2878 -0.4721 -0.3391 -0.1026 0.0941 0.0313 -0.0894 -0.2730 -0.2662 -0.2001 0.4236 0.0398 0.4354 0.0073 -0.2256 -0.1872 -0.1880 0.2377 -0.1224 -0.2290 0.2773 -0.2480 -0.1863 -0.1265 -0.1477 -0.1869 0.0827 0.0994 0.0989 0.0940 0.1030 0.0991 0.0940 0.1014 0.1334 0.1396 0.1456 0.1484 0.1617 0.1509 0.1501 0.1592 0.1619 0.1634 0.1624
va: 1.2686 1.2444 2.1346 2.0369 2.0663 3.1063 3.7131 3.8751 3.8740 3.9032 3.9109 3.8968 4.1479 4.2091 3.7070 3.6160 4.0812 3.9662 3.9410 3.7652 3.9055 4.0093 3.6837 4.0090 3.9025 3.8808 3.8867 3.8983 1.0449 1.0331 0.9998 1.0184 0.9986 1.0011 1.0053 1.0005 1.0171 1.0179 1.0114 1.0090 0.9886 1.0038 1.0066 0.9961 0.9880 0.9889 0.9890
dispcorr: -0.023095271 hartree
energy: -2050.695913975163
dipole: 10.05893 -10.04951 0.00941 -28.00459 27.91640 -0.08820 23.89901 -22.11552 1.78349
magnitude: 1.78569 au
magnitude: 4.53886 debye
