program: Orca
programVersion: 5.0.2
elementType: Cl Cl O O O N C C C C C C C C C C C C C C C C C C C C C C H H H H H H H H H H H H H H H H H H H
charge: 0
multiplicity: 1
keywords: wb97x-d3
keywords: def2-TZVPP
keywords: def2/J RIJCOSX
keywords: DEFGRID2
keywords: scfconv7
keywords: smallprint printgap noloewdin
keywords: NOSOSCF
formula: C22H19Cl2NO3
InChI: InChI=1/C22H19Cl2NO3/c1-22(2)17(12-19(23)24)20(22)21(26)28-18(13-25)14-7-6-10-16(11-14)27-15-8-4-3-5-9-15/h3-12,17-18,20H,1-2H3
47 atoms
Cl -1.713799 5.567219 1.604445
Cl -2.981178 6.534498 -0.79726
O  1.449552 0.767454 -1.540983
O  1.457258 1.69993 0.489613
O  -0.222016 -3.53729 0.409166
N  3.542895 -0.988188 -3.408216
C  -1.660304 1.54253 -0.256501
C  -1.174521 2.954258 -0.064997
C  -0.413768 2.023997 -0.97731
C  -1.549277 0.602402 0.918747
C  -2.86299 1.264634 -1.123308
C  -1.878494 4.099373 -0.65484
C  0.908296 1.522766 -0.567852
C  -2.148003 5.237827 -0.028937
C  2.625125 0.04908 -1.192762
C  2.347971 -1.06485 -0.207311
C  3.121701 -0.513533 -2.449162
C  1.206463 -1.84287 -0.353897
C  3.242756 -1.311322 0.822697
C  0.954986 -2.856739 0.556856
C  2.984532 -2.341975 1.716089
C  1.840677 -3.114727 1.597342
C  -0.272543 -4.883022 0.685958
C  -1.369171 -5.346383 1.396946
C  0.699386 -5.76034 0.221583
C  -1.493796 -6.706885 1.64374
C  0.567154 -7.115923 0.48577
C  -0.526048 -7.595362 1.196283
H  -0.705992 3.138077 0.895137
H  -0.534155 2.166791 -2.04559
H  -1.415297 -0.427554 0.582188
H  -2.471555 0.639675 1.500987
H  -0.731335 0.848289 1.592858
H  -2.898631 1.883063 -2.019067
H  -3.7837 1.431324 -0.561586
H  -2.856879 0.222356 -1.445874
H  -2.206541 4.01825 -1.684465
H  3.401286 0.716266 -0.803375
H  0.504495 -1.665749 -1.159803
H  4.129558 -0.700783 0.932993
H  3.673037 -2.536525 2.527193
H  1.64168 -3.900192 2.314851
H  -2.119802 -4.650319 1.749111
H  1.548637 -5.397461 -0.343874
H  -2.350447 -7.069515 2.196655
H  1.32345 -7.800902 0.125576
H  -0.623326 -8.654007 1.396632
elementType: Cl O N C H
totalener: -2050.67239533 hartree
nucrepener: 2709.75485457 hartree
electener: -4760.42724991 hartree
oneelecener: -8194.92526476 hartree
twoeener: 3434.49801485 hartree
cpcmener: -0.03738949 hartree
kineticenergy: 2044.45072004 hartree
xcener: -151.860807920251 hartree
chargesum: -0.0000000
charge: -0.057593 -0.061363 -0.282371 -0.449152 -0.341965 -0.100869 0.100294 0.026556 -0.069839 -0.271340 -0.265248 -0.204433 0.369490 0.037841 0.426540 0.039535 -0.223565 -0.292803 -0.203713 0.276927 -0.127701 -0.178538 0.257100 -0.238434 -0.175236 -0.134254 -0.157289 -0.176764 0.079336 0.104949 0.094555 0.107247 0.096938 0.093069 0.102073 0.099730 0.135936 0.148678 0.143320 0.149837 0.164076 0.162473 0.149713 0.160380 0.161650 0.162492 0.161735
qa: -0.0576 -0.0614 -0.2824 -0.4492 -0.3420 -0.1009 0.1003 0.0266 -0.0698 -0.2713 -0.2652 -0.2044 0.3695 0.0378 0.4265 0.0395 -0.2236 -0.2928 -0.2037 0.2769 -0.1277 -0.1785 0.2571 -0.2384 -0.1752 -0.1343 -0.1573 -0.1768 0.0793 0.1049 0.0946 0.1072 0.0969 0.0931 0.1021 0.0997 0.1359 0.1487 0.1433 0.1498 0.1641 0.1625 0.1497 0.1604 0.1616 0.1625 0.1617
va: 1.2676 1.2438 2.1205 2.0560 2.0346 3.1095 3.7312 3.8908 3.8263 3.9012 3.9021 3.8918 4.2310 4.2063 3.6849 3.5751 4.0894 4.0336 3.9910 3.7052 3.8976 3.9261 3.7052 4.0008 3.8974 3.8871 3.8911 3.8873 1.0480 1.0304 1.0031 1.0017 1.0140 1.0049 1.0012 1.0017 1.0152 1.0136 1.0251 1.0013 0.9890 0.9930 1.0061 0.9960 0.9883 0.9895 0.9890
dispcorr: -0.024604310 hartree
energy: -2050.696999641595
dipole: 0.96222 -1.69301 -0.73080 -42.13848 40.89866 -1.23982 3.66964 -2.80850 0.86114
magnitude: 1.67713 au
magnitude: 4.26293 debye
