program: Orca
programVersion: 5.0.2
elementType: Cl Cl O O O N C C C C C C C C C C C C C C C C C C C C C C H H H H H H H H H H H H H H H H H H H
charge: 0
multiplicity: 1
keywords: wb97x-d3
keywords: def2-TZVPP
keywords: def2/J RIJCOSX
keywords: DEFGRID2
keywords: scfconv7
keywords: smallprint printgap noloewdin
keywords: NOSOSCF
formula: C22H19Cl2NO3
InChI: InChI=1/C22H19Cl2NO3/c1-22(2)17(12-19(23)24)20(22)21(26)28-18(13-25)14-7-6-10-16(11-14)27-15-8-4-3-5-9-15/h3-12,17-18,20H,1-2H3
47 atoms
Cl -2.63642 4.477396 1.954689
Cl -3.649348 5.728666 -0.438852
O  1.92711 1.14249 -1.222198
O  1.28311 1.399992 0.903042
O  0.859445 -3.720824 -0.739543
N  4.693435 0.421891 -2.87036
C  -1.500391 1.001084 -0.621035
C  -1.369286 2.373735 -0.019665
C  -0.25679 1.832306 -0.88642
C  -1.452286 -0.182837 0.313369
C  -2.410337 0.775758 -1.803468
C  -2.156473 3.508257 -0.517538
C  1.02793 1.459757 -0.272859
C  -2.729233 4.43773 0.235991
C  3.14426 0.567657 -0.770591
C  2.948453 -0.813437 -0.184549
C  3.995918 0.494634 -1.958703
C  1.988433 -1.661912 -0.721089
C  3.72266 -1.216409 0.892272
C  1.802119 -2.914122 -0.159749
C  3.539027 -2.483922 1.42823
C  2.579037 -3.339157 0.912056
C  0.002197 -4.436529 0.060685
C  -0.554229 -3.895861 1.213571
C  -0.336147 -5.713728 -0.361052
C  -1.448552 -4.657431 1.952148
C  -1.240799 -6.458572 0.382256
C  -1.795804 -5.938083 1.543149
H  -1.157917 2.378641 1.043421
H  -0.180306 2.223986 -1.894618
H  -0.83814 -0.015778 1.19568
H  -1.073134 -1.065765 -0.204831
H  -2.461589 -0.413212 0.658151
H  -3.444652 0.667882 -1.472614
H  -2.130224 -0.143868 -2.319209
H  -2.372647 1.58253 -2.533722
H  -2.28585 3.602934 -1.589227
H  3.648625 1.216678 -0.046754
H  1.374503 -1.360929 -1.561396
H  4.460462 -0.545701 1.313718
H  4.144128 -2.80755 2.264258
H  2.439746 -4.323345 1.340896
H  -0.302068 -2.893382 1.536684
H  0.10289 -6.11875 -1.263875
H  -1.880501 -4.239011 2.851599
H  -1.504627 -7.454799 0.052615
H  -2.494785 -6.524716 2.123898
elementType: Cl O N C H
totalener: -2050.67250253 hartree
nucrepener: 2756.86475416 hartree
electener: -4807.53725669 hartree
oneelecener: -8288.80141850 hartree
twoeener: 3481.26416181 hartree
cpcmener: -0.03778304 hartree
kineticenergy: 2044.45328397 hartree
xcener: -151.862157962975 hartree
chargesum: -0.0000000
charge: -0.057693 -0.061750 -0.281468 -0.449542 -0.342916 -0.100839 0.110426 0.027455 -0.068211 -0.281138 -0.268175 -0.202828 0.371876 0.038120 0.413970 0.019116 -0.221749 -0.248761 -0.195958 0.235224 -0.132128 -0.160542 0.300362 -0.187351 -0.248414 -0.171856 -0.129683 -0.179412 0.077836 0.103972 0.100915 0.089418 0.110060 0.102903 0.099974 0.094333 0.133893 0.149623 0.144203 0.149155 0.164275 0.162291 0.160307 0.148030 0.160957 0.160619 0.161099
qa: -0.0577 -0.0618 -0.2815 -0.4495 -0.3429 -0.1008 0.1104 0.0275 -0.0682 -0.2811 -0.2682 -0.2028 0.3719 0.0381 0.4140 0.0191 -0.2217 -0.2488 -0.1960 0.2352 -0.1321 -0.1605 0.3004 -0.1874 -0.2484 -0.1719 -0.1297 -0.1794 0.0778 0.1040 0.1009 0.0894 0.1101 0.1029 0.1000 0.0943 0.1339 0.1496 0.1442 0.1492 0.1643 0.1623 0.1603 0.1480 0.1610 0.1606 0.1611
va: 1.2680 1.2433 2.1186 2.0547 2.0434 3.1100 3.7395 3.9009 3.8254 3.8999 3.9022 3.8961 4.2195 4.2092 3.7034 3.6060 4.0834 4.0039 3.9857 3.7772 3.8937 3.9104 3.6366 3.8745 4.0107 3.9234 3.8848 3.8920 1.0487 1.0310 1.0134 1.0015 1.0022 1.0007 1.0019 1.0051 1.0167 1.0131 1.0224 1.0011 0.9887 0.9924 0.9925 1.0074 0.9906 0.9881 0.9889
dispcorr: -0.025768965 hartree
energy: -2050.698271494907
dipole: 3.22407 -4.30608 -1.08201 -38.14415 36.91642 -1.22773 -0.88255 1.65381 0.77127
magnitude: 1.80912 au
magnitude: 4.59842 debye
