program: Gaussian 09
title: 000074525
version: EM64L-G09RevD.01
frameworkgroup: C1[X(C9H10N2)]
method: RPBEPBE
basis: SDD
operation: Freq
keyword: #pfreq=noraman
keyword: PBEPBE/SDD
title: #p freq=noraman PBEPBE/SDD
converged: YES YES NO NO
title: Mulliken charges:
elementType: N N C C C C C C C C C H H H H H H H H H H
charge: -0.460423 -0.073189 0.315091 -0.018761 -0.567198 0.493114 0.184243 -0.335570 -0.360491 -0.783085 -0.818350 0.303990 0.234650 0.244452 0.226101 0.271951 0.231851 0.232032 0.229765 0.219825 0.230000
chargesum: 0.00000
title: Mulliken charges with hydrogens summed into heavy atoms:
elementType: N N C C C C C C C C C
charge: -0.156433 -0.073189 0.315091 -0.018761 -0.332548 0.493114 0.184243 -0.091118 -0.134390 -0.047251 -0.138759
polarizability: 1.68860482e+02 -5.35762549e+00 1.07904384e+02 -1.83747415e-02 1.13360021e-03 5.43490197e+01
1716.lowfreq: -5.3170 0.0001 0.0004 0.0005 2.2229 4.4340 66.0845 88.2817 108.3932
frequency: 66.0213 88.2816 108.3930 195.0642 222.8822 272.7137 330.9166 358.7604 432.7321 433.3962 475.3051 582.4883 590.6000 608.7032 653.4073 673.9534 756.1625 772.2562 822.9612 830.3073 864.8308 930.6396 958.2200 958.6787 996.9343 1003.2750 1044.9013 1047.2663 1125.6939 1154.8552 1216.9790 1228.2588 1266.8244 1297.0775 1352.9708 1384.5520 1396.5373 1398.9089 1452.0667 1465.2073 1469.5496 1469.7188 1473.9912 1494.5748 1539.3216 1590.7758 1642.2319 2973.6281 2981.4544 3051.3725 3055.5550 3079.6686 3122.4644 3124.6097 3131.8818 3164.6756 3595.3553
redmass: 1.0759 1.0665 2.8940 3.6080 2.9123 3.8144 2.7000 4.4554 5.3448 2.8259 3.5945 4.9047 1.2660 3.2213 3.6203 5.3843 5.6629 3.5863 1.4379 4.8067 1.4750 2.6558 2.8185 1.3361 2.2577 1.5554 1.5369 1.4874 1.5358 2.0029 2.3315 1.6290 2.9986 2.2302 3.2764 3.3105 1.2554 1.2854 3.1191 1.4116 1.0460 1.0444 1.1889 2.4867 4.2884 7.2469 7.3078 1.0370 1.0392 1.0977 1.0980 1.0987 1.0963 1.0890 1.0922 1.0958 1.0812
irintensity: 0.8813 0.0930 1.4960 4.1332 2.9185 3.9077 0.1618 4.2895 0.8112 10.4763 7.8104 1.3163 72.9816 27.5528 10.0214 0.6932 0.0118 0.5339 59.4118 2.3674 7.9272 0.5035 1.1246 1.2714 0.9444 7.6006 14.3297 3.2010 2.6983 0.3063 10.5442 13.8793 26.5790 13.7714 78.5696 0.5006 6.9122 9.9983 38.5217 4.2705 10.5209 20.2189 11.2116 14.6412 45.7277 2.3365 23.6512 46.5932 38.3705 22.6526 20.4302 21.4145 5.4126 16.6271 15.4628 11.8450 35.2969
temp: 298.150 k
press: 1.00000 atm
elementType: 7 7 6 6 6 6 6 6 6 6 6 1 1 1 1 1 1 1 1 1 1
symmnumber: 1
zpe: 447288.6 jmol-1
zpe.correction: 0.170363 hartree
zpe.thermalcorrener: 0.180130 hartree
zpe.thermalcorrenthalpy: 0.181074 hartree
zpe.thermalcorrgfe: 0.135121 hartree
zpe.sumelectzpe: -457.695346 hartree
zpe.sumelectthermal: -457.685579 hartree
zpe.sumelectthermalent: -457.684635 hartree
zpe.sumelectthermalfe: -457.730588 hartree
dipole: 0.2093 -3.7347 0.0003
dipole: 3.7406
quadrupole: -54.0335 -59.6138 -68.6683
quadrupole: -8.0484 -0.0075 0.0024
quadrupole: 6.7384 1.1581 -7.8964 -8.0484 -0.0075 0.0024
hfenergy: -457.8657091 hartree
pointgroup: C01 [X(C9H10N2)]
dipole: 0.0774318 1.468666 -0.0526381 debye
dipolederiv: -0.6751544 0.0726139 -0.001225 -0.1299736 -0.4968262 0.0083066 0.0060496 0.0077788 -0.2790839 -0.5792371 -0.1553477 0.0064615 -0.1117664 -0.4953104 0.0084877 0.0051189 0.0087058 -0.2644698 0.3040335 0.1576251 -0.0062907 0.4745766 0.0438549 -0.0004068 -0.017758 0.0005268 0.0719387 0.3118042 0.0742286 -0.0036918 -0.20677 -0.0977168 0.0037354 0.0061122 0.0028568 -0.0099789 -0.0967864 -0.036542 0.0009769 -0.0560973 0.0318555 -0.0087058 0.0014378 -0.0086003 -0.2156411 0.2747938 -0.0667826 0.0019677 -0.2170972 0.0801509 -0.0037647 0.0094836 -0.0045979 -0.0353151 0.5483028 -0.1188233 0.0025898 0.0191185 0.7420822 -0.025325 -0.0015748 -0.0248856 0.0277514 0.1308835 0.0135943 -0.0012161 0.0363988 0.1272864 -0.0095383 -0.0021944 -0.009366 -0.1348917 -0.1926974 0.0858044 -0.0029844 0.292182 -0.027678 -0.0072657 -0.0105552 -0.0066608 -0.2145176 -0.1360025 0.017039 0.0002614 -0.0824695 0.0008309 0.003184 0.0025984 0.0027378 0.0904966 -0.1302057 0.0538571 -0.0015548 -0.0148289 0.0813789 -0.0000893 -0.001927 0.0000998 0.0729905 0.1792902 0.0172439 -0.0001424 0.0136954 0.1484442 0.0068977 -0.000077 0.0067642 0.3458662 0.0594994 0.0348199 -0.0008302 0.0502588 -0.107887 0.0098859 -0.0013739 0.0098131 0.1748483 0.0871058 0.041405 -0.0012378 0.012115 -0.076484 0.0084288 -0.0001333 0.0083247 0.1607328 -0.0743883 -0.1138473 0.0047132 -0.1010938 0.0153193 0.0052381 0.004405 0.00536 0.1556537 0.0638759 0.0267573 -0.0006065 0.1242068 -0.0277182 0.0046404 -0.0036622 0.0050803 0.1304456 -0.0200523 -0.0317089 0.0184557 -0.0739813 0.0489596 0.106178 0.1005475 0.1037275 -0.0513285 -0.021379 -0.0338355 -0.016757 -0.0813456 0.0350399 -0.1110671 -0.0954975 -0.1089725 -0.0364561 -0.0492729 0.005894 0.0818214 -0.0110988 0.070377 0.0791905 0.1430917 0.0421513 -0.0507369 0.0660735 -0.0454059 0.0013646 0.0822676 -0.1594047 0.0072901 -0.0019744 0.0077777 0.1055191 -0.0504866 0.0014108 -0.0820757 -0.018297 0.0634455 -0.0853005 -0.142117 -0.0486213 -0.0438234 unknown
polarizability: 168.8230999|5.5480944|107.872122|-0.4898549|-1.9204124|54.4186637 unknown
InChI: InChI=1S/C9H10N2/c1-6-3-4-8-9(5-6)11-7(2)10-8/h3-5,11H,1-2H3
charge 0 multiplicity 1
21 atoms
N  1.420858 1.200432 -0.039726
N  1.764321 -1.053053 0.039069
C  0.137893 0.631339 -0.015879
C  0.373454 -0.783757 0.033576
C  -1.158736 1.186006 -0.032028
C  -2.255894 0.293864 0.002444
C  2.359346 0.151163 -0.005333
C  -0.727249 -1.669156 0.068159
C  -2.023238 -1.118363 0.052199
C  3.837697 0.393861 -0.018369
C  -3.68254 0.818971 -0.013396
H  1.64116 2.19398 -0.074985
H  -1.326781 2.26843 -0.069812
H  -0.56441 -2.750546 0.106166
H  -2.890683 -1.789216 0.078628
H  4.351713 -0.578484 0.011345
H  4.159513 0.92998 -0.931084
H  4.165939 0.987756 0.855487
H  -4.240274 0.493355 0.885034
H  -3.71145 1.922043 -0.044369
H  -4.238639 0.443594 -0.893328
