program: Orca
programVersion: 5.0.2
elementType: Cl Cl O O O N C C C C C C C C C C C C C C C C C C C C C C H H H H H H H H H H H H H H H H H H H
charge: 0
multiplicity: 1
keywords: wb97x-d3
keywords: def2-TZVPP
keywords: def2/J RIJCOSX
keywords: DEFGRID2
keywords: scfconv7
keywords: smallprint printgap noloewdin
keywords: NOSOSCF
formula: C22H19Cl2NO3
InChI: InChI=1/C22H19Cl2NO3/c1-22(2)17(12-19(23)24)20(22)21(26)28-18(13-25)14-7-6-10-16(11-14)27-15-8-4-3-5-9-15/h3-12,17-18,20H,1-2H3
47 atoms
Cl -2.192071 -0.109363 -1.475472
Cl -4.224824 0.107258 0.558703
O  2.083293 2.043834 -0.153599
O  2.210842 1.98604 2.073128
O  0.561312 -2.721177 -1.019184
N  4.150499 1.53149 -2.679112
C  -0.451288 3.710735 0.130715
C  -0.805285 2.256477 0.049558
C  0.199841 2.740702 1.091713
C  0.308652 4.318859 -1.023601
C  -1.417102 4.683729 0.765604
C  -2.082014 1.706813 0.516201
C  1.583316 2.242238 1.074399
C  -2.733289 0.703003 -0.059888
C  3.26313 1.253211 -0.237714
C  2.954057 -0.197306 0.048306
C  3.743977 1.421444 -1.608951
C  1.896214 -0.807596 -0.618859
C  3.678269 -0.893987 1.002309
C  1.579362 -2.119347 -0.321056
C  3.3497 -2.213891 1.285001
C  2.297673 -2.832352 0.630403
C  -0.604124 -3.025493 -0.364116
C  -1.439649 -3.938088 -0.995729
C  -0.974396 -2.440286 0.840134
C  -2.658169 -4.260331 -0.418515
C  -2.197456 -2.775983 1.404831
C  -3.043917 -3.684167 0.785135
H  -0.365293 1.74147 -0.795781
H  -0.176594 2.800926 2.10641
H  1.021947 5.065345 -0.670714
H  -0.394985 4.825575 -1.685701
H  0.846559 3.589913 -1.623858
H  -0.888524 5.588832 1.06861
H  -1.910743 4.283456 1.650121
H  -2.188601 4.974223 0.05087
H  -2.529399 2.135051 1.405036
H  4.046128 1.621665 0.432093
H  1.317414 -0.273294 -1.363658
H  4.492785 -0.410619 1.525943
H  3.913379 -2.761519 2.027839
H  2.037778 -3.859709 0.852418
H  -1.138565 -4.38533 -1.934829
H  -0.3379 -1.717131 1.333283
H  -3.306875 -4.970755 -0.914322
H  -2.488756 -2.313653 2.338595
H  -3.995027 -3.938692 1.233142
elementType: Cl O N C H
totalener: -2050.66926618 hartree
nucrepener: 2962.74004563 hartree
electener: -5013.40931181 hartree
oneelecener: -8701.00356811 hartree
twoeener: 3687.59425630 hartree
cpcmener: -0.03830851 hartree
kineticenergy: 2044.47008423 hartree
xcener: -151.867219417851 hartree
chargesum: -0.0000000
charge: -0.060928 -0.063597 -0.279946 -0.460298 -0.335344 -0.098156 0.093636 0.028367 -0.051543 -0.259230 -0.275512 -0.216086 0.387521 0.074770 0.405915 -0.013486 -0.228392 -0.197241 -0.169026 0.200582 -0.132884 -0.148455 0.267187 -0.235645 -0.151602 -0.135473 -0.206975 -0.176917 0.086996 0.097230 0.102414 0.096132 0.090997 0.100520 0.093923 0.101417 0.131633 0.143778 0.142918 0.151257 0.164102 0.160561 0.147109 0.148487 0.160795 0.158436 0.160054
qa: -0.0609 -0.0636 -0.2799 -0.4603 -0.3353 -0.0982 0.0936 0.0284 -0.0515 -0.2592 -0.2755 -0.2161 0.3875 0.0748 0.4059 -0.0135 -0.2284 -0.1972 -0.1690 0.2006 -0.1329 -0.1485 0.2672 -0.2356 -0.1516 -0.1355 -0.2070 -0.1769 0.0870 0.0972 0.1024 0.0961 0.0910 0.1005 0.0939 0.1014 0.1316 0.1438 0.1429 0.1513 0.1641 0.1606 0.1471 0.1485 0.1608 0.1584 0.1601
va: 1.2654 1.2388 2.1240 2.0426 2.0470 3.1059 3.7505 3.8582 3.8363 3.9009 3.9210 3.9271 4.1797 4.1724 3.7529 3.6326 4.0784 4.0233 3.9475 3.8035 3.8845 3.9525 3.6435 3.9768 3.7685 3.9074 3.8839 3.8661 1.0243 1.0285 1.0004 0.9999 1.0115 1.0004 1.0050 1.0003 1.0209 1.0139 1.0204 1.0010 0.9883 0.9941 1.0079 1.0058 0.9873 0.9956 0.9887
dispcorr: -0.029875196 hartree
energy: -2050.699141379952
dipole: 7.38344 -8.13151 -0.74807 11.11903 -10.38904 0.72999 7.85798 -6.15388 1.70410
magnitude: 1.99911 au
magnitude: 5.08133 debye
