program: Gaussian 09
title: 000074523
version: EM64L-G09RevD.01
frameworkgroup: C1[X(C9H20N2O)]
method: RPBEPBE
basis: SDD
operation: Freq
keyword: #p
keyword: freq=noraman
keyword: PBEPBE/SDD
title: #p freq=noraman PBEPBE/SDD
converged: YES YES NO NO
title: Mulliken charges:
elementType: O N N C C C C C C C C C H H H H H H H H H H H H H H H H H H H H
charge: -0.314389 -0.405294 -0.405186 -0.326403 -0.326461 -0.388843 -0.388875 -0.351561 -0.351473 0.305668 -0.686190 -0.686161 0.217860 0.189833 0.217869 0.189882 0.200418 0.259045 0.200413 0.259005 0.190076 0.189327 0.190118 0.189189 0.278035 0.277996 0.214517 0.213558 0.209978 0.214514 0.213555 0.209980
chargesum: 0.00000
title: Mulliken charges with hydrogens summed into heavy atoms:
elementType: O N N C C C C C C C C C
charge: -0.314389 -0.127259 -0.127191 0.081290 0.081290 0.070620 0.070543 0.027842 0.027835 0.305668 -0.048137 -0.048112
polarizability: 1.47853587e+02 3.61102906e-02 1.06014464e+02 -6.98791308e+00 3.03725244e-02 9.82296228e+01
1716.lowfreq: -12.1496 -5.1966 -0.0011 -0.0009 -0.0008 6.1024 20.5102 25.9358 46.7969
frequency: 18.6202 23.4933 46.7834 60.4204 65.8806 78.0951 108.7343 123.5368 190.9086 218.7862 224.0960 231.0258 257.9791 276.2406 301.2412 323.8262 364.5257 465.2712 484.3105 515.2165 528.3540 643.7056 709.0454 733.9892 738.6755 796.5311 835.0651 838.1494 852.2030 899.0638 945.5135 962.1162 978.7780 997.6490 1042.7417 1056.9264 1091.5538 1114.8070 1117.4312 1129.5961 1135.1449 1173.4296 1215.9846 1228.4927 1233.4931 1262.3385 1264.7480 1290.1979 1290.7352 1312.4591 1312.6691 1351.0438 1352.4713 1363.2222 1370.0278 1389.2443 1389.4052 1443.3523 1450.8583 1455.4326 1456.3390 1465.6420 1471.6021 1471.9523 1476.4492 1476.5933 1485.0073 1485.1433 1505.1303 1631.3097 2955.8789 2955.9820 2973.2293 2973.2755 2974.8659 2975.0313 2981.6832 2982.5184 3001.1021 3001.2443 3042.5425 3042.7154 3071.1473 3071.1540 3072.6204 3072.7609 3074.6051 3074.9908 3551.0792 3558.6385
redmass: 3.4183 3.6166 3.6844 3.7805 1.5702 1.9240 2.9237 2.9446 3.9309 2.0652 1.1516 1.3341 1.3723 1.9771 2.9833 1.9564 2.5850 2.7530 1.5307 1.7617 2.7264 3.3149 7.6538 1.1895 1.1924 1.6690 2.3087 1.4863 1.8567 1.6002 1.5412 1.5821 1.7644 2.3271 3.4755 2.4671 2.9992 2.0771 2.0908 1.7034 2.0710 3.0063 1.4736 1.3247 1.4305 1.3331 1.3916 1.0960 1.1061 1.2625 1.2629 1.4315 1.5133 1.3466 1.3053 1.2127 1.2127 1.2382 1.0927 1.0913 1.0848 1.3051 1.0695 1.0737 1.0426 1.0425 1.0720 1.0718 2.2202 5.1019 1.0588 1.0588 1.0498 1.0499 1.0471 1.0479 1.0669 1.0669 1.0988 1.0988 1.1009 1.1009 1.1000 1.1000 1.0994 1.0995 1.0980 1.0979 1.0775 1.0766
irintensity: 0.0160 1.7865 0.0088 18.0355 0.0400 2.8384 0.9260 0.0255 0.4256 2.8297 0.0524 1.8369 0.3763 2.6308 4.4020 6.5715 27.4154 1.0263 105.1992 164.2492 0.0029 9.6873 6.4034 0.6291 26.3656 3.7013 4.3314 0.6841 3.5489 3.4520 3.3465 6.7011 18.2695 0.4731 5.9773 0.1989 9.2140 0.3279 3.8379 5.8417 0.0191 4.9521 94.3549 2.3080 73.7964 0.1314 141.3902 1.2800 0.1872 16.6623 51.2429 0.1684 6.7928 2.4909 0.2540 5.4847 12.7709 46.1698 36.5958 5.7384 1.0345 2.8654 13.3781 1.5487 11.0601 12.3118 8.0183 19.8985 556.4449 169.0434 24.6294 35.2806 7.8416 32.7302 106.6533 25.8223 93.6882 3.6241 9.9993 8.3470 88.9937 13.4973 55.3406 74.0708 50.6018 36.7375 31.8018 24.4450 7.8136 7.1190
temp: 298.150 k
press: 1.00000 atm
elementType: 8 7 7 6 6 6 6 6 6 6 6 6 1 1 1 1 1 1 1 1 1 1 1 1 1 1 1 1 1 1 1 1
symmnumber: 1
zpe: 747713.1 jmol-1
zpe.correction: 0.284789 hartree
zpe.thermalcorrener: 0.300565 hartree
zpe.thermalcorrenthalpy: 0.301510 hartree
zpe.thermalcorrgfe: 0.238964 hartree
zpe.sumelectzpe: -538.705537 hartree
zpe.sumelectthermal: -538.689761 hartree
zpe.sumelectthermalent: -538.688816 hartree
zpe.sumelectthermalfe: -538.751362 hartree
dipole: -0.0011 -4.1066 -0.0146
dipole: 4.1067
quadrupole: -69.5738 -80.0657 -75.2796
quadrupole: 0.0118 -4.0500 -0.0092
quadrupole: 5.3992 -5.0927 -0.3066 0.0118 -4.0500 -0.0092
hfenergy: -538.990326 hartree
pointgroup: C01 [X(C9H20N2O1)]
dipole: 0.0000671 -0.0089301 -1.6156615 debye
polarizability: 147.9960035|6.4607597|98.0873382|-0.0564949|0.0451368|106.0143317 unknown
InChI: InChI=1S/C9H20N2O/c1-3-5-7-10-9(12)11-8-6-4-2/h10-11H,3-8H2,1-2H3
charge 0 multiplicity 1
32 atoms
O  -0.000682 0.009076 1.815695
N  1.01349 0.597038 -0.213584
N  -1.01367 -0.604367 -0.206578
C  3.435233 0.342289 0.477945
C  -3.434428 -0.335943 0.482705
C  2.17089 1.233813 0.434064
C  -2.17233 -1.2311 0.448561
C  4.008698 -0.003439 -0.915134
C  -4.00892 -0.006075 -0.913749
C  -0.000279 0.001063 0.5436
C  5.285366 -0.868764 -0.83674
C  -5.281416 0.866123 -0.844397
H  3.194495 -0.588284 1.027974
H  4.210932 0.871828 1.069091
H  -3.190412 0.600751 1.02082
H  -4.210749 -0.855899 1.081495
H  2.397684 2.183322 -0.091279
H  1.853028 1.477536 1.462365
H  -2.4014 -2.185971 -0.065912
H  -1.85484 -1.463773 1.47953
H  4.230005 0.936053 -1.463743
H  3.240984 -0.543749 -1.506753
H  -4.235675 -0.951691 -1.449474
H  -3.239917 0.522746 -1.514044
H  1.018086 0.498909 -1.229124
H  -1.017986 -0.518507 -1.223237
H  5.081874 -1.824827 -0.319252
H  5.679843 -1.104374 -1.842361
H  6.082226 -0.347089 -0.273998
H  -5.072211 1.828518 -0.341112
H  -5.677465 1.089194 -1.852259
H  -6.079155 0.356191 -0.272215
