program: Orca
programVersion: 5.0.2
elementType: Cl Cl O O O N C C C C C C C C C C C C C C C C C C C C C C H H H H H H H H H H H H H H H H H H H
charge: 0
multiplicity: 1
keywords: wb97x-d3
keywords: def2-TZVPP
keywords: def2/J RIJCOSX
keywords: DEFGRID2
keywords: scfconv7
keywords: smallprint printgap noloewdin
keywords: NOSOSCF
formula: C22H19Cl2NO3
InChI: InChI=1/C22H19Cl2NO3/c1-22(2)17(12-19(23)24)20(22)21(26)28-18(13-25)14-7-6-10-16(11-14)27-15-8-4-3-5-9-15/h3-12,17-18,20H,1-2H3
47 atoms
Cl -3.17523 3.466682 0.541571
Cl -3.426822 6.271042 -0.105608
O  0.292968 0.963412 0.727611
O  -0.857169 0.415816 -1.108626
O  1.729155 -4.675643 -0.854715
N  1.102126 -0.434643 3.595032
C  0.32573 3.21851 -2.044952
C  -1.126531 3.327561 -1.736864
C  -0.211585 2.694399 -0.716553
C  0.769769 2.262648 -3.123428
C  1.192647 4.447921 -1.932919
C  -1.76593 4.623836 -1.419948
C  -0.317896 1.257976 -0.435177
C  -2.66731 4.769059 -0.459811
C  0.331615 -0.402961 1.097797
C  1.306554 -1.217845 0.275221
C  0.760645 -0.404021 2.497083
C  1.035781 -2.564228 0.083222
C  2.464547 -0.644783 -0.234322
C  1.947714 -3.347848 -0.612045
C  3.347195 -1.436007 -0.954634
C  3.102406 -2.787822 -1.139398
C  1.107792 -5.443846 0.102603
C  1.490017 -5.392107 1.437484
C  0.121694 -6.320259 -0.323316
C  0.864613 -6.227192 2.351247
C  -0.486602 -7.159381 0.600552
C  -0.123193 -7.113125 1.939204
H  -1.768174 2.628202 -2.267542
H  0.051451 3.300281 0.142852
H  0.833191 2.795454 -4.073928
H  0.086982 1.427779 -3.2653
H  1.760558 1.860217 -2.90449
H  1.152904 5.02849 -2.85658
H  2.232327 4.163968 -1.763134
H  0.891366 5.101473 -1.113604
H  -1.504949 5.493777 -2.011783
H  -0.665414 -0.855051 1.058613
H  0.119573 -2.990998 0.4738
H  2.684723 0.403314 -0.080697
H  4.248144 -0.998877 -1.363351
H  3.801141 -3.405458 -1.688865
H  2.267876 -4.714176 1.766281
H  -0.163883 -6.348609 -1.367181
H  1.160173 -6.187566 3.39152
H  -1.25464 -7.845683 0.268721
H  -0.60356 -7.764364 2.657051
elementType: Cl O N C H
totalener: -2050.67043078 hartree
nucrepener: 2722.72523324 hartree
electener: -4773.39566402 hartree
oneelecener: -8221.13148715 hartree
twoeener: 3447.73582313 hartree
cpcmener: -0.03694444 hartree
kineticenergy: 2044.46555851 hartree
xcener: -151.862984210750 hartree
chargesum: -0.0000000
charge: -0.052565 -0.056595 -0.282019 -0.460636 -0.339964 -0.100647 0.142541 -0.030192 -0.141567 -0.272245 -0.280981 -0.213583 0.399169 0.072835 0.412923 0.019954 -0.221387 -0.185697 -0.221987 0.255847 -0.129849 -0.218727 0.267559 -0.178235 -0.241895 -0.149353 -0.128328 -0.183747 0.113865 0.116774 0.101918 0.094817 0.098424 0.103339 0.099887 0.095520 0.143065 0.146994 0.145604 0.151165 0.161310 0.151382 0.159523 0.149645 0.162721 0.161254 0.162163
qa: -0.0526 -0.0566 -0.2820 -0.4606 -0.3400 -0.1006 0.1425 -0.0302 -0.1416 -0.2722 -0.2810 -0.2136 0.3992 0.0728 0.4129 0.0200 -0.2214 -0.1857 -0.2220 0.2558 -0.1298 -0.2187 0.2676 -0.1782 -0.2419 -0.1494 -0.1283 -0.1837 0.1139 0.1168 0.1019 0.0948 0.0984 0.1033 0.0999 0.0955 0.1431 0.1470 0.1456 0.1512 0.1613 0.1514 0.1595 0.1496 0.1627 0.1613 0.1622
va: 1.2781 1.2499 2.1127 2.0441 2.0632 3.1116 3.7139 3.8868 3.8278 3.8896 3.9145 3.9074 4.1387 4.1856 3.7062 3.6160 4.0783 3.9694 3.9383 3.7311 3.9135 3.9995 3.6907 3.9058 4.0056 3.8880 3.8802 3.8951 1.0220 1.0238 1.0021 1.0157 1.0010 0.9993 1.0029 0.9990 1.0070 1.0179 1.0056 1.0109 0.9886 1.0036 0.9957 1.0062 0.9891 0.9881 0.9889
dispcorr: -0.024644620 hartree
energy: -2050.695075396413
dipole: 24.09682 -23.42048 0.67634 -21.14437 21.77853 0.63416 -13.70108 12.01381 -1.68727
magnitude: 1.92522 au
magnitude: 4.89351 debye
