program: Gaussian 09
title: 000074517
version: EM64L-G09RevD.01
frameworkgroup: C1[X(C8H15NO2)]
method: RPBEPBE
basis: SDD
operation: Freq
keyword: #p
keyword: freq=noraman
keyword: PBEPBE/SDD
title: #p freq=noraman PBEPBE/SDD
converged: YES YES NO NO
title: Mulliken charges:
elementType: O O N C C C C C C C C H H H H H H H H H H H H H H H
charge: -0.256437 -0.233648 -0.177950 -0.011912 -0.406203 -0.706279 -0.694474 0.266993 0.220138 -0.732139 -0.793527 0.201133 0.264951 0.218343 0.222192 0.200243 0.222705 0.211093 0.248590 0.209103 0.263540 0.241406 0.249637 0.237623 0.266733 0.268145
chargesum: 0.00000
title: Mulliken charges with hydrogens summed into heavy atoms:
elementType: O O N C C C C C C C C
charge: -0.256437 -0.233648 -0.177950 0.189222 0.077092 -0.061140 -0.025687 0.266993 0.220138 0.022443 -0.021025
polarizability: 1.04949331e+02 -2.41132833e-01 1.11237195e+02 7.78561507e+00 -2.28128727e+00 8.08607370e+01
1716.lowfreq: -16.5465 -6.9636 -0.0009 -0.0008 -0.0007 7.8052 41.1085 59.1430 73.5640
frequency: 40.7985 59.0499 73.4999 133.7774 150.3255 161.2235 212.4941 245.8635 256.2293 264.2897 272.4163 299.7856 373.5864 384.2113 403.8898 448.0205 490.5271 555.6267 561.2908 595.6148 627.4213 703.6853 780.3030 843.8132 910.7753 934.6204 953.4101 963.5756 976.7910 1017.5630 1036.4664 1039.5177 1076.5461 1125.0642 1142.9734 1192.7243 1224.7904 1243.4709 1295.9691 1314.7141 1347.0112 1372.2229 1377.9862 1379.3718 1390.6459 1398.4671 1430.0871 1444.1896 1449.9317 1461.3833 1466.0527 1470.6456 1478.0184 1483.9422 1492.7966 1605.1205 1610.9752 2959.2130 2968.6984 2982.2957 3002.8374 3012.2445 3035.5266 3062.1951 3067.0342 3072.7127 3093.7286 3098.7373 3102.2057 3103.0756 3131.5047 3131.8946
redmass: 3.4539 3.4194 4.0941 3.9321 2.1574 1.3203 1.0367 1.0164 2.8600 4.6370 1.4259 2.1264 2.1639 2.9720 4.6614 1.8594 3.3432 3.2403 3.1003 3.8025 3.2846 3.5623 3.1252 2.1072 1.2938 1.7152 2.1128 1.6589 1.9679 1.8187 1.6961 1.7119 1.8942 2.6039 2.1296 1.9993 2.1026 3.3972 1.7331 1.5187 1.4526 1.2843 1.2421 1.2207 1.2107 1.2263 1.1004 1.0749 1.0504 1.0517 1.0826 1.0511 1.0516 1.0548 1.0571 6.2974 8.7853 1.0825 1.0365 1.0366 1.0380 1.0358 1.0595 1.0998 1.0990 1.0985 1.1036 1.0959 1.0993 1.0962 1.1005 1.1025
irintensity: 2.1476 5.2579 1.2162 4.1944 0.1645 1.1677 0.4767 0.0911 0.6210 10.3274 0.2809 0.1346 0.0294 2.9837 0.9880 1.3152 3.4587 8.4720 11.4531 20.2101 4.3121 2.8001 3.4299 27.7427 2.0689 5.6825 5.8928 11.7646 31.9832 21.7321 0.9460 14.1849 21.8806 10.6878 68.8233 6.5716 234.9443 59.3782 69.1373 25.4457 61.1625 28.2557 28.0564 68.3507 47.3837 21.6727 35.1781 39.2899 18.5247 9.9349 3.5818 13.6752 2.0406 32.6691 20.9258 64.8353 265.3558 26.1735 26.9832 22.7735 5.4519 4.2246 30.2974 34.9684 9.2255 98.5227 9.2530 4.8730 19.3033 4.6897 6.2659 16.0212
temp: 298.150 k
press: 1.00000 atm
elementType: 8 8 7 6 6 6 6 6 6 6 6 1 1 1 1 1 1 1 1 1 1 1 1 1 1 1
symmnumber: 1
zpe: 579408.1 jmol-1
zpe.correction: 0.220685 hartree
zpe.thermalcorrener: 0.233740 hartree
zpe.thermalcorrenthalpy: 0.234684 hartree
zpe.thermalcorrgfe: 0.181492 hartree
zpe.sumelectzpe: -518.178682 hartree
zpe.sumelectthermal: -518.165627 hartree
zpe.sumelectthermalent: -518.164683 hartree
zpe.sumelectthermalfe: -518.217875 hartree
dipole: 2.1759 2.0836 1.2677
dipole: 3.2685
quadrupole: -65.9099 -73.8486 -68.3276
quadrupole: 2.5071 -1.1279 6.8333
quadrupole: 3.4522 -4.4866 1.0344 2.5071 -1.1279 6.8333
hfenergy: -518.3993671 hartree
pointgroup: C01 [X(C8H15N1O2)]
dipole: -0.6659777 -0.9776363 0.5042888 debye
dipolederiv: -0.6100717 0.1856596 0.1118622 0.0572921 -1.0325335 -0.1161594 0.1119822 -0.1934568 -0.4085434 -0.7826936 0.2481236 0.309882 0.0273734 -0.6098062 0.0385337 0.3943708 -0.144163 -0.5617723 -0.73978 -0.0858185 0.1424015 0.2433871 -1.6399364 -0.1544166 0.1615844 0.0295925 -0.3513217 0.149334 -0.0009778 0.0001563 0.0117502 0.1577584 0.0229364 0.0400077 0.0300124 0.1083542 0.4769652 0.0342514 -0.0377153 -0.0441608 0.0077093 -0.0210059 -0.1576906 -0.0499932 0.2032757 0.0085269 -0.007072 -0.0400524 -0.0158141 -0.0398962 -0.079049 -0.0553106 -0.0601272 0.0105507 0.0444781 0.0154175 -0.0233291 -0.007328 -0.0834851 0.045563 -0.0292148 0.0209591 -0.0070723 0.8232674 0.3028411 -0.2577949 0.1798109 1.7426834 0.122479 -0.224981 -0.041342 0.290161 0.8644002 -0.5330906 -0.4773447 -0.4305879 1.4553291 -0.0228101 -0.5391525 0.1242575 0.5999981 -0.3087869 -0.0675359 0.1662948 0.0087804 0.0481031 0.0115163 0.195833 0.059309 -0.0718678 -0.0402923 -0.1293629 0.0527619 -0.0594166 -0.3475594 0.1479377 0.0684269 0.1854699 -0.0619928 -0.1277846 -0.0013367 0.1267869 0.0009074 0.0295758 -0.0066348 0.0953018 -0.0131163 -0.0709707 0.0305188 -0.0129513 -0.0138449 0.0616168 0.0322315 -0.1327447 -0.0051266 -0.0478473 0.0421329 -0.0103471 -0.0041274 -0.0194409 -0.0108069 -0.0464659 0.1580745 -0.0083469 0.1125549 0.0084162 -0.1121652 -0.0246702 -0.1323309 0.031192 0.083984 0.010836 -0.1370632 -0.0239735 0.0032797 0.1094563 0.0141644 0.0025136 0.0046724 -0.129795 0.1019845 0.0055662 0.1432934 -0.0293535 -0.0579716 0.0481296 0.1288736 -0.0006782 0.0548041 -0.0085824 0.1288883 -0.0238231 0.0158925 -0.0379227 -0.003373 0.142466 0.0388331 0.0569647 -0.0197866 0.1233997 0.0089493 -0.0174547 0.143067 -0.0396056 0.0003952 -0.0169844 -0.0720506 -0.0569122 0.0138285 -0.0882973 0.0383694 -0.1431257 0.0254554 -0.1316483 -0.0304741 0.093215 0.0050485 -0.1324451 0.0362128 0.0087177 0.0972176 -0.0208422 -0.0406308 -0.0148411 0.1128433 -0.0532059 -0.0154455 -0.0270623 -0.020133 0.0747703 -0.0223703 0.0132923 -0.094316 -0.1119813 -0.000958 -0.0067974 -0.0403945 0.1139208 0.030838 0.0361371 -0.0361402 0.0801228 0.0633465 0.0702277 -0.0572802 0.0604908 0.0641265 0.1195044 -0.0029628 0.0101845 -0.0243763 0.0671486 -0.050199 0.0006658 -0.0021975 -0.089773 0.0218313 0.1225604 0.0245398 0.0632665 0.0152708 -0.0106432 0.0600237 -0.0449379 0.0965694 -0.0232342 -0.0766429 -0.0221382 -0.0592205 0.0925418 -0.0020295 -0.0310249 -0.0103698 0.0864904 unknown
polarizability: 105.6837817|-1.72227|110.8395449|-7.5419674|-0.1120336|80.5239361 unknown
InChI: InChI=1S/C8H15NO2/c1-6(2)5-9(7(3)10)8(4)11/h6H,5H2,1-4H3
charge 0 multiplicity 1
26 atoms
O  0.298798 2.336297 0.652492
O  2.073901 -1.125863 -0.866181
N  0.430031 0.024212 0.373022
C  -2.135165 -0.096028 0.122901
C  -0.894048 -0.061981 1.066737
C  -2.277935 -1.413844 -0.674889
C  -2.196755 1.12122 -0.829731
C  0.95703 1.3577 0.201105
C  1.140609 -1.152959 -0.016689
C  2.301041 1.563065 -0.470441
C  0.774642 -2.460343 0.683537
H  -3.002189 -0.028421 0.815437
H  -0.965569 0.835062 1.704169
H  -0.89713 -0.951722 1.718272
H  -3.190435 -1.38133 -1.297861
H  -2.36117 -2.294768 -0.010296
H  -1.421935 -1.567757 -1.359002
H  -1.383015 1.078596 -1.577876
H  -2.095828 2.072057 -0.280814
H  -3.155996 1.125378 -1.379481
H  2.258607 1.286739 -1.536609
H  2.555518 2.628621 -0.362759
H  3.090857 0.932462 -0.029582
H  0.817245 -2.355718 1.782722
H  1.509634 -3.213645 0.363422
H  -0.232742 -2.815331 0.413297
