program: Gaussian 09
title: 000074576
version: EM64L-G09RevD.01
frameworkgroup: C1[X(C15H18OSi)]
method: RPBEPBE
basis: SDD
operation: Freq
keyword: #p
keyword: freq=noraman
keyword: PBEPBE/SDD
title: #p freq=noraman PBEPBE/SDD
converged: YES YES NO NO
title: Mulliken charges:
elementType: Si O C C C C C C C C C C C C C C C H H H H H H H H H H H H H H H H H H
charge: 1.420731 -0.591547 -0.193656 -0.233599 -1.052334 -0.295663 -0.299729 -0.316333 -0.307421 -0.201033 -0.238082 -0.235923 -0.231077 -0.228183 -0.232086 -0.234361 -0.664814 0.260468 0.236071 0.246941 0.246545 0.232455 0.233238 0.275483 0.202504 0.189820 0.228822 0.225779 0.227028 0.225678 0.229331 0.226784 0.197867 0.223657 0.226635
chargesum: 0.00000
title: Mulliken charges with hydrogens summed into heavy atoms:
elementType: Si O C C C C C C C C C C C C C C C
charge: 1.420731 -0.591547 -0.193656 -0.233599 -0.308854 -0.049117 -0.067274 -0.083095 -0.031937 0.191292 -0.009260 -0.010144 -0.004048 -0.002506 -0.002755 -0.007577 -0.016654
polarizability: 2.16894243e+02 9.09884625e+00 1.76378199e+02 -1.74559179e+01 3.29960240e+00 1.51559530e+02
1716.lowfreq: -16.6524 -10.3728 -3.9899 0.0010 0.0014 0.0019 8.7216 26.4930 30.3752
frequency: -11.2578 26.1659 30.0871 41.7776 51.4720 58.7725 95.2735 127.9036 155.4794 162.2142 199.7916 212.0545 232.4938 243.5739 261.9096 262.6200 344.4163 391.5172 393.7744 401.5785 445.5180 481.7635 494.6345 614.4173 614.5964 628.8201 681.6497 692.3107 706.2742 707.8435 724.3020 749.6204 754.1543 804.4700 842.4251 849.1931 861.5460 866.0872 926.9111 928.4814 933.4948 980.7581 986.1062 987.2810 988.1310 1000.1977 1003.5138 1023.0482 1024.1521 1059.9570 1073.5558 1076.6587 1101.4686 1102.6757 1110.0959 1136.2605 1172.4309 1173.7011 1192.7586 1198.6691 1258.4581 1297.7462 1309.1211 1314.6944 1360.0269 1366.6919 1367.4899 1385.1738 1418.8121 1419.9697 1442.1439 1449.1105 1457.1067 1469.2612 1472.0811 1476.9816 1490.8196 1577.1901 1578.1933 1597.9194 1599.5869 2932.2041 2983.2800 2984.9099 2987.3363 3084.5196 3084.9491 3094.6277 3099.3707 3106.3220 3113.4855 3116.6308 3120.5404 3129.5134 3133.9761 3141.8140 3146.6446 3159.0116 3159.3570
redmass: 2.5341 3.6933 3.7165 4.1406 2.8052 3.3135 3.4988 2.4664 1.9424 1.6982 3.1187 2.9926 4.6469 1.7660 4.7941 2.3738 4.7732 2.7580 2.7901 3.9976 5.5743 3.5990 4.0390 6.3992 6.4170 5.1769 4.8605 5.3480 1.7687 2.0204 3.3832 1.7812 1.9515 1.0887 1.4696 1.4396 1.2468 1.2472 1.5570 2.1782 1.3633 1.4066 1.4094 5.9483 5.7812 1.3156 1.3166 2.9762 2.7973 4.3122 1.7007 1.7154 2.3730 2.4770 2.9451 1.4618 1.0566 1.0569 1.1259 1.1293 1.1338 1.2229 1.3911 1.4015 1.3250 4.2179 5.4796 1.2573 2.1236 2.1265 1.0543 1.0617 1.0419 2.0538 1.9854 1.0492 1.0799 5.4745 5.6477 5.7765 5.8335 1.0555 1.0832 1.0558 1.0359 1.0982 1.0985 1.0981 1.1012 1.0875 1.0856 1.0872 1.0862 1.0912 1.0915 1.0959 1.0955 1.1014 1.1014
irintensity: 0.0279 0.0326 0.0381 0.1321 2.2189 0.6236 1.8310 1.3626 0.7043 1.6798 0.6322 4.2007 2.9508 1.3488 2.3221 6.6096 15.4746 0.1395 0.0298 5.8441 29.5222 39.4867 43.4435 0.6261 0.4070 20.2841 18.2272 11.4784 55.0725 27.9220 115.8540 38.1867 15.3814 3.6501 67.0076 110.0277 0.1888 0.6310 28.8460 83.0530 0.3460 0.1444 0.0082 0.3920 1.0416 0.0202 0.1392 0.9165 2.4343 242.8211 7.3042 1.9082 11.1315 29.3593 62.3872 4.2765 0.1865 0.2553 4.8380 3.5158 1.4333 31.5398 7.8240 15.3336 16.2407 2.0851 0.4877 31.3240 23.8541 10.6353 5.2444 8.1599 10.5686 6.5661 4.4785 7.9699 3.8148 0.1613 0.2101 1.2046 0.1510 61.3677 21.9017 29.6774 31.5894 4.6043 52.1264 12.6408 38.6035 8.6598 3.9813 2.6261 0.8825 6.4820 20.4468 44.1438 25.5111 53.8247 16.2772
temp: 298.150 k
press: 1.00000 atm
elementType: 14 8 6 6 6 6 6 6 6 6 6 6 6 6 6 6 6 1 1 1 1 1 1 1 1 1 1 1 1 1 1 1 1 1 1
symmnumber: 1
zpe: 748143.8 jmol-1
zpe.correction: 0.284953 hartree
zpe.thermalcorrener: 0.302190 hartree
zpe.thermalcorrenthalpy: 0.303134 hartree
zpe.thermalcorrgfe: 0.237813 hartree
zpe.sumelectzpe: -945.807735 hartree
zpe.sumelectthermal: -945.790498 hartree
zpe.sumelectthermalent: -945.789553 hartree
zpe.sumelectthermalfe: -945.854874 hartree
dipole: -1.3761 -0.3856 0.5508
dipole: 1.5316
quadrupole: -99.3928 -103.1272 -105.3427
quadrupole: -0.9106 -3.4692 1.2431
quadrupole: 3.2281 -0.5063 -2.7218 -0.9106 -3.4692 1.2431
hfenergy: -946.0926875 hartree
pointgroup: C01 [X(C15H18O1Si1)]
dipole: -0.5167931 -0.1994833 0.2371263 debye
polarizability: 213.4709622|12.6174237|178.3181944|-20.1076934|1.2395115|153.0428149 unknown
InChI: InChI=1S/C15H18OSi/c1-3-16-17(2,14-10-6-4-7-11-14)15-12-8-5-9-13-15/h4-13H,3H2,1-2H3
charge 0 multiplicity 1
35 atoms
Si -0.05022 0.660071 0.782473
O  -0.187184 2.169704 -0.09407
C  -1.435513 -0.545113 0.25675
C  1.652101 0.027702 0.223446
C  -0.137388 0.984192 2.658973
C  -1.43646 -1.091012 -1.058141
C  2.081215 -1.292641 0.530113
C  -2.501764 -0.898015 1.128666
C  2.532764 0.878335 -0.497902
C  -1.384111 3.017851 -0.073653
C  -2.465538 -1.958916 -1.486333
C  3.359305 -1.749484 0.134529
C  -3.533968 -1.768199 0.706268
C  3.810496 0.423104 -0.897233
C  -3.518111 -2.299399 -0.603787
C  4.227701 -0.89037 -0.578981
C  -1.174541 4.15799 -1.072368
H  0.657117 1.694553 2.948566
H  -1.108923 1.415667 2.962697
H  0.017765 0.050774 3.230765
H  -0.621735 -0.840172 -1.749089
H  1.413643 -1.977581 1.069677
H  -2.530571 -0.498881 2.150617
H  2.200675 1.89167 -0.750346
H  -2.279331 2.419122 -0.347126
H  -1.542132 3.422988 0.949573
H  -2.446694 -2.370058 -2.502187
H  3.674577 -2.770732 0.377954
H  -4.345522 -2.030029 1.395082
H  4.477508 1.090344 -1.455504
H  -4.316603 -2.973978 -0.933889
H  5.21858 -1.243839 -0.887445
H  -2.051866 4.831861 -1.084695
H  -0.281358 4.74659 -0.799453
H  -1.025113 3.752602 -2.087947
