program: Orca
programVersion: 5.0.2
elementType: Cl Cl O O O N C C C C C C C C C C C C C C C C C C C C C C H H H H H H H H H H H H H H H H H H H
charge: 0
multiplicity: 1
keywords: wb97x-d3
keywords: def2-TZVPP
keywords: def2/J RIJCOSX
keywords: DEFGRID2
keywords: scfconv7
keywords: smallprint printgap noloewdin
keywords: NOSOSCF
formula: C22H19Cl2NO3
InChI: InChI=1/C22H19Cl2NO3/c1-22(2)17(12-19(23)24)20(22)21(26)28-18(13-25)14-7-6-10-16(11-14)27-15-8-4-3-5-9-15/h3-12,17-18,20H,1-2H3
47 atoms
Cl -3.268483 1.131577 2.167388
Cl -2.845427 3.440624 3.843388
O  2.220337 1.574694 -0.520093
O  0.402739 0.52024 -1.274546
O  1.401448 -4.162016 0.012068
N  2.976859 -0.099715 -3.385247
C  -0.924397 3.34626 -1.015712
C  -1.245573 2.540976 0.205569
C  0.201193 2.678805 -0.249671
C  -1.382807 2.810246 -2.349883
C  -0.94421 4.854655 -0.954092
C  -1.624615 3.158601 1.480267
C  0.895957 1.481027 -0.738741
C  -2.462011 2.638437 2.368589
C  3.020006 0.43817 -0.826287
C  2.7023 -0.740812 0.066255
C  2.958317 0.128756 -2.258161
C  2.196093 -1.93185 -0.430284
C  2.91437 -0.582796 1.432293
C  1.877707 -2.956512 0.451473
C  2.603226 -1.619186 2.297263
C  2.074817 -2.807726 1.815045
C  0.479318 -4.206589 -1.005226
C  -0.549633 -3.278772 -1.118761
C  0.583818 -5.264469 -1.896993
C  -1.473114 -3.418787 -2.145558
C  -0.353965 -5.396955 -2.911413
C  -1.381676 -4.473044 -3.045021
H  -1.68737 1.572456 0.000652
H  0.819927 3.352898 0.331275
H  -0.681768 3.084466 -3.139879
H  -2.348471 3.253305 -2.599397
H  -1.508451 1.730306 -2.364335
H  -0.372515 5.267917 -1.786286
H  -0.515328 5.25356 -0.036241
H  -1.967324 5.224439 -1.038833
H  -1.179603 4.113697 1.732611
H  4.04207 0.771409 -0.63105
H  2.041868 -2.068874 -1.493608
H  3.318814 0.343128 1.820977
H  2.765029 -1.500497 3.360189
H  1.822246 -3.614759 2.490807
H  -0.641436 -2.456109 -0.420515
H  1.39036 -5.979709 -1.79443
H  -2.27381 -2.696537 -2.236063
H  -0.271709 -6.223925 -3.604349
H  -2.10702 -4.575255 -3.841109
elementType: Cl O N C H
totalener: -2050.67148801 hartree
nucrepener: 2803.41472775 hartree
electener: -4854.08621576 hartree
oneelecener: -8383.27799009 hartree
twoeener: 3529.19177433 hartree
cpcmener: -0.03879566 hartree
kineticenergy: 2044.45699476 hartree
xcener: -151.864728323715 hartree
chargesum: -0.0000000
charge: -0.056823 -0.060768 -0.287670 -0.472040 -0.339777 -0.092018 0.093047 0.020887 -0.078824 -0.270114 -0.269311 -0.200228 0.440547 0.041224 0.491215 -0.020382 -0.248084 -0.175076 -0.255422 0.259945 -0.113337 -0.234410 0.289972 -0.188665 -0.255109 -0.147219 -0.122910 -0.190580 0.086918 0.097116 0.102172 0.098997 0.094901 0.099203 0.093801 0.102117 0.132557 0.148124 0.140227 0.146535 0.162326 0.150551 0.153236 0.148277 0.162269 0.161240 0.161363
qa: -0.0568 -0.0608 -0.2877 -0.4720 -0.3398 -0.0920 0.0930 0.0209 -0.0788 -0.2701 -0.2693 -0.2002 0.4405 0.0412 0.4912 -0.0204 -0.2481 -0.1751 -0.2554 0.2599 -0.1133 -0.2344 0.2900 -0.1887 -0.2551 -0.1472 -0.1229 -0.1906 0.0869 0.0971 0.1022 0.0990 0.0949 0.0992 0.0938 0.1021 0.1326 0.1481 0.1402 0.1465 0.1623 0.1506 0.1532 0.1483 0.1623 0.1612 0.1614
va: 1.2686 1.2445 2.1375 2.0287 2.0696 3.1029 3.7355 3.8856 3.8652 3.9039 3.9092 3.8994 4.1006 4.2112 3.8200 3.6758 4.0868 3.8801 3.9869 3.7860 3.8842 4.0181 3.6814 3.8897 4.0049 3.8897 3.8780 3.9024 1.0393 1.0336 0.9992 0.9999 1.0182 1.0008 1.0058 1.0002 1.0186 0.9914 1.0156 1.0071 0.9876 1.0040 1.0042 1.0075 0.9895 0.9879 0.9892
dispcorr: -0.024407770 hartree
energy: -2050.695895781475
dipole: 8.44712 -7.87980 0.56733 -0.92868 2.86595 1.93727 -22.11753 23.42891 1.31138
magnitude: 2.40720 au
magnitude: 6.11860 debye
