program: Orca
programVersion: 5.0.2
elementType: Cl Cl O O O N C C C C C C C C C C C C C C C C C C C C C C H H H H H H H H H H H H H H H H H H H
charge: 0
multiplicity: 1
keywords: wb97x-d3
keywords: def2-TZVPP
keywords: def2/J RIJCOSX
keywords: DEFGRID2
keywords: scfconv7
keywords: smallprint printgap noloewdin
keywords: NOSOSCF
formula: C22H19Cl2NO3
InChI: InChI=1/C22H19Cl2NO3/c1-22(2)17(12-19(23)24)20(22)21(26)28-18(13-25)14-7-6-10-16(11-14)27-15-8-4-3-5-9-15/h3-12,17-18,20H,1-2H3
47 atoms
Cl -0.177424 0.218628 2.302678
Cl -1.937931 1.388684 4.27374
O  2.017164 1.789566 -0.543689
O  0.343231 0.91539 -1.73757
O  0.553409 -3.560328 -0.369461
N  3.108224 0.408806 -3.5081
C  -1.369267 3.278413 -0.583285
C  -1.505221 2.081145 0.286028
C  -0.115159 2.579977 -0.080276
C  -1.789965 3.178305 -2.028408
C  -1.60604 4.643587 0.015956
C  -1.936662 2.145902 1.698143
C  0.719679 1.686998 -0.890416
C  -1.425654 1.356306 2.63253
C  2.903803 0.740415 -0.923273
C  2.581651 -0.52168 -0.160605
C  2.964797 0.554836 -2.375969
C  1.781411 -1.519859 -0.697201
C  3.02173 -0.608436 1.156113
C  1.372678 -2.572059 0.110464
C  2.642045 -1.688581 1.936778
C  1.798885 -2.665397 1.426627
C  -0.47226 -3.201153 -1.215445
C  -1.285878 -2.106667 -0.944158
C  -0.69217 -3.992233 -2.333087
C  -2.318781 -1.79913 -1.81663
C  -1.740747 -3.681794 -3.189474
C  -2.551361 -2.582224 -2.941065
H  -1.795796 1.167008 -0.227833
H  0.418032 3.107586 0.701654
H  -1.170764 3.817486 -2.659728
H  -2.821689 3.520365 -2.126417
H  -1.745682 2.165434 -2.420743
H  -2.671091 4.881724 0.010932
H  -1.092706 5.408648 -0.568063
H  -1.250572 4.719353 1.04388
H  -2.716679 2.842579 1.98244
H  3.889761 1.102839 -0.62516
H  1.461856 -1.4783 -1.730327
H  3.653141 0.167273 1.570609
H  2.986081 -1.761691 2.959757
H  1.476371 -3.493801 2.044249
H  -1.120308 -1.49492 -0.065506
H  -0.04945 -4.841015 -2.531397
H  -2.948436 -0.943097 -1.609059
H  -1.913288 -4.299381 -4.061639
H  -3.359569 -2.338112 -3.617532
elementType: Cl O N C H
totalener: -2050.66764742 hartree
nucrepener: 2993.54172491 hartree
electener: -5044.20937233 hartree
oneelecener: -8763.55137823 hartree
twoeener: 3719.34200590 hartree
cpcmener: -0.03894086 hartree
kineticenergy: 2044.46273887 hartree
xcener: -151.866914988960 hartree
chargesum: -0.0000000
charge: -0.055671 -0.058159 -0.284822 -0.466236 -0.343170 -0.097618 0.156461 -0.060855 -0.066343 -0.274257 -0.282293 -0.225749 0.378391 0.100964 0.466286 -0.010119 -0.236479 -0.145157 -0.242603 0.233820 -0.132428 -0.219849 0.268080 -0.172131 -0.229232 -0.175706 -0.139534 -0.167689 0.110603 0.109554 0.102287 0.097244 0.089937 0.103149 0.100330 0.094554 0.143782 0.144567 0.141304 0.145063 0.160675 0.149546 0.151338 0.148992 0.166312 0.161487 0.161375
qa: -0.0557 -0.0582 -0.2848 -0.4662 -0.3432 -0.0976 0.1565 -0.0609 -0.0663 -0.2743 -0.2823 -0.2257 0.3784 0.1010 0.4663 -0.0101 -0.2365 -0.1452 -0.2426 0.2338 -0.1324 -0.2198 0.2681 -0.1721 -0.2292 -0.1757 -0.1395 -0.1677 0.1106 0.1096 0.1023 0.0972 0.0899 0.1031 0.1003 0.0946 0.1438 0.1446 0.1413 0.1451 0.1607 0.1495 0.1513 0.1490 0.1663 0.1615 0.1614
va: 1.3042 1.2492 2.1295 2.0198 2.0676 3.1049 3.7214 3.9022 3.8230 3.8910 3.9112 3.9022 4.1201 4.1610 3.8607 3.5866 4.0726 3.8890 3.9604 3.7791 3.8457 3.9753 3.6923 3.8550 3.9909 3.8964 3.8878 3.8861 1.0143 1.0262 0.9990 1.0011 1.0163 0.9990 1.0025 0.9992 1.0077 0.9935 1.0202 1.0041 0.9893 1.0037 1.0019 1.0059 0.9865 0.9875 0.9888
dispcorr: -0.030363924 hartree
energy: -2050.698011342985
dipole: -7.79085 7.10158 -0.68927 9.14239 -7.38638 1.75601 -20.02164 21.98556 1.96392
magnitude: 2.72317 au
magnitude: 6.92176 debye
