program: Orca
programVersion: 5.0.2
elementType: Cl Cl O O O N C C C C C C C C C C C C C C C C C C C C C C H H H H H H H H H H H H H H H H H H H
charge: 0
multiplicity: 1
keywords: wb97x-d3
keywords: def2-TZVPP
keywords: def2/J RIJCOSX
keywords: DEFGRID2
keywords: scfconv7
keywords: smallprint printgap noloewdin
keywords: NOSOSCF
formula: C22H19Cl2NO3
InChI: InChI=1/C22H19Cl2NO3/c1-22(2)17(12-19(23)24)20(22)21(26)28-18(13-25)14-7-6-10-16(11-14)27-15-8-4-3-5-9-15/h3-12,17-18,20H,1-2H3
47 atoms
Cl -2.723879 0.262052 -1.111998
Cl -4.281512 0.40435 1.30955
O  1.76001 1.712551 -0.461615
O  2.564833 2.117642 1.580182
O  0.644481 -3.011082 1.018168
N  2.882147 0.618987 -3.36448
C  -0.395715 3.818103 0.356699
C  -0.892555 2.405852 0.256264
C  0.322552 2.717536 1.111972
C  0.221216 4.432702 -0.875635
C  -1.137384 4.820356 1.207143
C  -2.101641 1.914638 0.927389
C  1.657011 2.178313 0.792161
C  -2.920943 0.994634 0.432385
C  2.922812 0.965658 -0.775667
C  2.936955 -0.382202 -0.086689
C  2.880657 0.785356 -2.22834
C  1.748269 -1.081736 0.083367
C  4.139453 -0.899916 0.369864
C  1.77616 -2.308486 0.732334
C  4.151348 -2.133937 1.003755
C  2.975664 -2.84198 1.188105
C  -0.403458 -3.069445 0.138747
C  -1.678822 -3.078547 0.687607
C  -0.219871 -3.19319 -1.23287
C  -2.778881 -3.228174 -0.143594
C  -1.331999 -3.329783 -2.052621
C  -2.611779 -3.353473 -1.515684
H  -0.671154 1.929304 -0.690571
H  0.159689 2.739176 2.183988
H  0.981639 5.166285 -0.600427
H  -0.546792 4.954582 -1.449436
H  0.68139 3.704865 -1.540804
H  -1.993881 5.221559 0.661954
H  -0.484557 5.657691 1.460319
H  -1.504009 4.400989 2.143344
H  -2.32936 2.296968 1.915482
H  3.835482 1.522503 -0.537932
H  0.808704 -0.673994 -0.270245
H  5.058418 -0.342419 0.239856
H  5.084402 -2.545782 1.364895
H  2.98069 -3.799518 1.693344
H  -1.804979 -2.978651 1.75885
H  0.773577 -3.194863 -1.664353
H  -3.771947 -3.237176 0.287275
H  -1.189142 -3.427434 -3.121441
H  -3.471846 -3.464678 -2.162888
elementType: Cl O N C H
totalener: -2050.68288624 hartree
nucrepener: 2930.30282140 hartree
electener: -4980.98570764 hartree
oneelecener: -8636.26468330 hartree
twoeener: 3655.27897566 hartree
cpcmener: -0.03197499 hartree
kineticenergy: 2044.46807149 hartree
xcener: -151.865428755879 hartree
chargesum: 0.0000000
charge: -0.057699 -0.063908 -0.282317 -0.425766 -0.325961 -0.085050 0.081841 0.048511 -0.070590 -0.258416 -0.269347 -0.220867 0.376946 0.062089 0.371844 0.027816 -0.228555 -0.179410 -0.214934 0.266614 -0.103701 -0.240915 0.313619 -0.263197 -0.201372 -0.126129 -0.133915 -0.188138 0.084023 0.099777 0.099826 0.097003 0.094182 0.101510 0.098616 0.091065 0.131191 0.147509 0.132721 0.144112 0.158161 0.147828 0.144123 0.153689 0.151589 0.158703 0.155282
qa: -0.0577 -0.0639 -0.2823 -0.4258 -0.3260 -0.0851 0.0818 0.0485 -0.0706 -0.2584 -0.2693 -0.2209 0.3769 0.0621 0.3718 0.0278 -0.2286 -0.1794 -0.2149 0.2666 -0.1037 -0.2409 0.3136 -0.2632 -0.2014 -0.1261 -0.1339 -0.1881 0.0840 0.0998 0.0998 0.0970 0.0942 0.1015 0.0986 0.0911 0.1312 0.1475 0.1327 0.1441 0.1582 0.1478 0.1441 0.1537 0.1516 0.1587 0.1553
va: 1.2702 1.2406 2.1087 2.0840 2.0872 3.1079 3.7727 3.8043 3.8291 3.9086 3.9125 3.9168 4.1974 4.1876 3.7615 3.6184 4.0676 3.9595 3.9930 3.7410 3.8885 4.0074 3.6523 3.9707 3.9102 3.8472 3.8737 3.8732 1.0425 1.0280 1.0004 1.0004 1.0115 1.0005 1.0014 1.0053 1.0192 1.0136 1.0154 1.0026 0.9892 1.0056 1.0089 0.9990 0.9942 0.9895 0.9911
dispcorr: -0.028092862 hartree
energy: -2050.710979099937
dipole: 12.46281 -12.64007 -0.17726 11.71543 -10.67453 1.04091 1.30588 -0.37464 0.93124
magnitude: 1.40787 au
magnitude: 3.57853 debye
