program: Gaussian 09
title: 000074562
version: EM64L-G09RevD.01
frameworkgroup: C1[X(C14H10O6S)]
method: RPBEPBE
basis: SDD
operation: Freq
keyword: #p
keyword: freq=noraman
keyword: PBEPBE/SDD
title: #p freq=noraman PBEPBE/SDD
converged: YES YES NO NO
title: Mulliken charges:
elementType: S O O O O O O C C C C C C C C C C C C C C H H H H H H H H H H
charge: 0.245732 -0.398469 -0.376829 -0.419775 -0.454333 -0.328641 -0.214805 -0.215895 -0.228926 0.112134 0.157820 -0.233417 -0.213616 -0.228791 -0.243760 0.141152 0.165491 -0.320588 -0.372209 0.169779 0.107115 0.298612 0.315344 0.257329 0.259972 0.263701 0.226653 0.389578 0.359803 0.394316 0.385522
chargesum: 0.00000
title: Mulliken charges with hydrogens summed into heavy atoms:
elementType: S O O O O O O C C C C C C C C C C C C C C
charge: 0.245732 -0.008892 -0.017025 -0.025459 -0.068811 -0.328641 -0.214805 -0.215895 -0.228926 0.112134 0.157820 0.065195 0.101728 0.028538 0.016212 0.141152 0.165491 -0.056887 -0.145556 0.169779 0.107115
polarizability: 2.54909319e+02 -1.74230037e+00 1.94199078e+02 -4.27269782e+01 3.38399829e+00 1.52977181e+02
1716.lowfreq: -19.0423 -9.4832 -4.1238 -3.3395 0.0009 0.0012 0.0015 14.5577 24.8846
frequency: -10.0014 14.4360 24.8215 29.4613 84.2595 102.1091 129.0079 140.3622 147.8558 158.0001 186.7563 248.4828 269.1986 305.5599 317.4631 346.2856 356.2299 379.9279 386.2107 404.0596 410.2899 418.0984 424.5953 430.9884 506.5782 511.3752 524.1926 539.5720 584.0542 590.8172 611.1748 621.3360 631.8178 636.9181 683.7144 688.7415 735.6549 748.4811 756.4261 762.6063 809.6318 825.8190 840.5141 845.9783 851.7206 918.9565 932.4189 954.1691 969.8718 982.2343 1026.3485 1071.9546 1087.7206 1094.2493 1118.3851 1153.2660 1160.9954 1167.7837 1227.4166 1257.6015 1258.2202 1288.3416 1299.6122 1304.4474 1370.0368 1386.3356 1394.9836 1406.3018 1411.4984 1463.1342 1479.1905 1565.1198 1572.3362 1588.0311 1595.3439 1642.3664 1654.2041 3051.4015 3120.0759 3147.2309 3159.9029 3169.7886 3180.2191 3184.2234 3531.5337 3536.0173 3549.6087
redmass: 7.0176 6.7242 11.6980 9.5890 8.3977 6.5602 7.0885 6.2207 5.4134 10.0125 7.4553 6.9756 6.6814 7.3230 6.8099 6.9920 7.8229 10.0972 11.8923 1.2383 8.8228 3.1806 2.6163 9.0771 4.2443 4.4780 3.0445 2.8910 1.2638 1.3150 5.1487 5.7110 6.2606 8.5279 4.9315 4.9518 6.0031 5.8369 4.2165 4.4097 1.5613 1.3344 6.9075 1.2325 7.3102 1.4533 1.4225 1.3730 1.3486 4.9346 3.9002 2.4130 1.9788 2.2061 1.7262 1.7133 1.5854 1.1987 1.3862 3.0749 3.0479 1.3324 2.4948 1.6323 4.4095 6.2858 6.4444 7.2657 1.9148 3.0585 2.6866 6.4579 4.4778 6.4960 6.9709 5.1296 8.8829 1.0681 1.0895 1.0899 1.0955 1.0922 1.0959 1.0922 1.0642 1.0642 1.0658
irintensity: 0.2623 0.5863 0.5686 0.9432 0.2081 0.0692 0.9222 2.8456 2.1804 1.4385 0.3041 6.9650 0.8369 0.9567 1.0653 1.6422 13.4457 7.8116 6.3152 123.0068 1.0583 8.7703 0.8827 3.8173 27.1212 12.0873 10.1840 9.4358 214.8539 102.5245 30.9850 29.2323 5.6409 34.2321 16.1164 4.4363 19.1208 13.3863 1.1350 2.9190 50.2881 172.5124 13.5681 14.4892 4.1430 8.1087 5.1632 3.0658 0.5186 225.3179 191.1399 41.5143 93.1542 66.9281 73.2657 156.0546 70.4291 24.7271 119.9647 133.3568 22.7093 49.4309 92.8877 48.1280 31.8377 35.1009 1.0160 0.5158 264.0765 155.5474 67.4062 134.2548 35.4508 32.7125 6.9921 168.7255 332.1001 251.8735 16.0226 1.7850 4.3874 0.6193 5.2419 2.1558 67.1995 41.2447 49.5998
temp: 298.150 k
press: 1.00000 atm
elementType: 16 8 8 8 8 8 8 6 6 6 6 6 6 6 6 6 6 6 6 6 6 1 1 1 1 1 1 1 1 1 1
symmnumber: 1
zpe: 558981.8 jmol-1
zpe.correction: 0.212905 hartree
zpe.thermalcorrener: 0.230986 hartree
zpe.thermalcorrenthalpy: 0.231931 hartree
zpe.thermalcorrgfe: 0.164650 hartree
zpe.sumelectzpe: -1387.425947 hartree
zpe.sumelectthermal: -1387.407866 hartree
zpe.sumelectthermalent: -1387.406921 hartree
zpe.sumelectthermalfe: -1387.474202 hartree
dipole: 1.5737 1.3950 -2.7633
dipole: 3.4725
quadrupole: -137.0537 -127.7126 -112.4179
quadrupole: 8.0879 -12.7155 2.3365
quadrupole: -11.3256 -1.9845 13.3102 8.0879 -12.7155 2.3365
hfenergy: -1387.6388522 hartree
pointgroup: C01 [X(C14H10O6S1)]
dipole: 0.5153799 -1.1243416 -0.5802763 debye
polarizability: 245.6555881|-51.7764681|162.4874372|0.215964|-4.998827|193.9425525 unknown
InChI: InChI=1S/C14H10O6S/c15-11-3-1-7(5-9(11)13(17)18)21-8-2-4-12(16)10(6-8)14(19)20/h1-6,15-17,19H
charge 0 multiplicity 1
31 atoms
S  0.045184 0.101374 -2.727737
O  -4.786652 1.215992 0.759144
O  4.707734 -1.35212 0.877576
O  -2.168734 -1.977662 1.796907
O  2.17409 2.01692 1.692135
O  -4.080757 -0.767341 2.286175
O  3.999901 0.805017 2.448295
C  -1.368549 0.408582 -1.58308
C  1.406805 -0.351633 -1.571251
C  -2.766192 -0.146901 0.347656
C  2.814631 0.103313 0.401688
C  -1.6304 -0.402331 -0.469388
C  1.720566 0.430056 -0.443939
C  -2.25397 1.475748 -1.905885
C  2.205017 -1.476383 -1.88867
C  -3.66569 0.925397 0.013116
C  3.622684 -1.028241 0.066634
C  -3.393315 1.725845 -1.125208
C  3.309308 -1.802145 -1.080097
C  -3.068672 -0.956943 1.529603
C  3.096934 0.947229 1.594198
H  -0.969402 -1.231888 -0.203416
H  1.120993 1.307018 -0.189071
H  -2.038882 2.113446 -2.769919
H  1.961329 -2.094211 -2.75873
H  -4.080118 2.54187 -1.365004
H  3.928104 -2.672884 -1.332414
H  -4.836068 0.558661 1.536632
H  5.179061 -2.149813 0.524928
H  -2.456283 -2.461885 2.616901
H  2.404741 2.545413 2.502122
