program: Orca
programVersion: 5.0.2
elementType: Cl Cl O O O N C C C C C C C C C C C C C C C C C C C C C C H H H H H H H H H H H H H H H H H H H
charge: 0
multiplicity: 1
keywords: wb97x-d3
keywords: def2-TZVPP
keywords: def2/J RIJCOSX
keywords: DEFGRID2
keywords: scfconv7
keywords: smallprint printgap noloewdin
keywords: NOSOSCF
formula: C22H19Cl2NO3
InChI: InChI=1/C22H19Cl2NO3/c1-22(2)17(12-19(23)24)20(22)21(26)28-18(13-25)14-7-6-10-16(11-14)27-15-8-4-3-5-9-15/h3-12,17-18,20H,1-2H3
47 atoms
Cl -1.559536 0.506963 -1.525365
Cl -4.310147 0.59948 -0.64664
O  1.66045 1.138522 0.295067
O  1.787666 3.108685 -0.744041
O  1.114071 -3.871734 0.303158
N  2.690206 0.725313 -2.94517
C  -0.6586 3.944964 1.042561
C  -1.221219 3.201791 -0.118272
C  -0.081897 2.589394 0.681944
C  0.105744 5.218899 0.78153
C  -1.437649 3.969291 2.336313
C  -2.541947 2.536852 -0.082237
C  1.202621 2.366711 0.002664
C  -2.773122 1.36911 -0.665627
C  2.844212 0.678338 -0.332176
C  3.032687 -0.75755 0.095242
C  2.731411 0.740292 -1.797087
C  1.961419 -1.636534 -0.025418
C  4.250253 -1.185846 0.597917
C  2.110296 -2.948649 0.394872
C  4.392656 -2.51216 0.987621
C  3.329219 -3.392487 0.898993
C  -0.201428 -3.483633 0.320944
C  -0.699616 -2.626143 1.2948
C  -1.039834 -4.030906 -0.6379
C  -2.050339 -2.311776 1.291496
C  -2.39289 -3.720686 -0.618517
C  -2.90192 -2.85541 0.338597
H  -0.928856 3.57752 -1.095831
H  -0.372105 1.781903 1.34408
H  0.573292 5.246294 -0.199088
H  0.883037 5.370487 1.531204
H  -0.578694 6.066542 0.841024
H  -1.948884 3.026901 2.537477
H  -2.189449 4.760959 2.316672
H  -0.77136 4.16713 3.177402
H  -3.364306 3.024128 0.428971
H  3.707094 1.28487 -0.038874
H  1.020764 -1.296267 -0.440523
H  5.079142 -0.495992 0.689513
H  5.338667 -2.859221 1.381164
H  3.43712 -4.421425 1.21758
H  -0.047608 -2.206285 2.050723
H  -0.637845 -4.699394 -1.388492
H  -2.438833 -1.639377 2.045492
H  -3.04738 -4.152686 -1.364419
H  -3.954802 -2.608125 0.345285
elementType: Cl O N C H
totalener: -2050.68266606 hartree
nucrepener: 2924.19971321 hartree
electener: -4974.88237927 hartree
oneelecener: -8624.48397805 hartree
twoeener: 3649.60159878 hartree
cpcmener: -0.03335746 hartree
kineticenergy: 2044.48460203 hartree
xcener: -151.866862717750 hartree
chargesum: 0.0000000
charge: -0.054031 -0.056568 -0.270708 -0.438768 -0.324348 -0.085751 0.147966 -0.043913 -0.139029 -0.275529 -0.282898 -0.202985 0.396032 0.084977 0.415079 0.017893 -0.239622 -0.197219 -0.212854 0.267895 -0.100792 -0.246590 0.292603 -0.198116 -0.244164 -0.139693 -0.115494 -0.192266 0.122486 0.108381 0.095588 0.100585 0.095141 0.093874 0.102470 0.100015 0.140875 0.132250 0.126495 0.145777 0.157750 0.147192 0.155414 0.145899 0.157267 0.157812 0.153619
qa: -0.0540 -0.0566 -0.2707 -0.4388 -0.3243 -0.0858 0.1480 -0.0439 -0.1390 -0.2755 -0.2829 -0.2030 0.3960 0.0850 0.4151 0.0179 -0.2396 -0.1972 -0.2129 0.2679 -0.1008 -0.2466 0.2926 -0.1981 -0.2442 -0.1397 -0.1155 -0.1923 0.1225 0.1084 0.0956 0.1006 0.0951 0.0939 0.1025 0.1000 0.1409 0.1322 0.1265 0.1458 0.1578 0.1472 0.1554 0.1459 0.1573 0.1578 0.1536
va: 1.2840 1.2501 2.1501 2.0634 2.0885 3.1120 3.7182 3.8900 3.8621 3.8842 3.9147 3.9072 4.1528 4.1538 3.7723 3.7036 4.0297 3.9574 3.9579 3.7832 3.8968 4.0078 3.6670 3.9231 4.0234 3.8367 3.8831 3.8866 1.0169 1.0226 1.0193 0.9993 1.0010 0.9995 0.9994 1.0029 1.0072 1.0134 1.0254 1.0030 0.9895 1.0066 0.9966 1.0074 0.9916 0.9892 0.9975
dispcorr: -0.027907080 hartree
energy: -2050.710573143006
dipole: 7.80970 -8.38470 -0.57500 11.18173 -10.63913 0.54260 18.18493 -15.25857 2.92636
magnitude: 3.03127 au
magnitude: 7.70488 debye
