program: Gaussian 09
title: 000074528
version: EM64L-G09RevD.01
frameworkgroup: C1[X(C8H20ClN2OP)]
method: RPBEPBE
basis: SDD
operation: Freq
keyword: #p
keyword: freq=noraman
keyword: PBEPBE/SDD
title: #p freq=noraman PBEPBE/SDD
converged: YES YES NO NO
title: Mulliken charges:
elementType: Cl P O N N C C C C C C C C H H H H H H H H H H H H H H H H H H H H
charge: -0.248400 1.074611 -0.567494 -0.492002 -0.490981 -0.276126 -0.318326 -0.287490 -0.329498 -0.662702 -0.651709 -0.677333 -0.658734 0.231107 0.222880 0.255889 0.210855 0.245156 0.235269 0.261385 0.219808 0.218430 0.229887 0.218646 0.208396 0.255671 0.216567 0.222056 0.226438 0.223600 0.212682 0.250903 0.220561
chargesum: 0.00000
title: Mulliken charges with hydrogens summed into heavy atoms:
elementType: Cl P O N N C C C C C C C C
charge: -0.248400 1.074611 -0.567494 -0.492002 -0.490981 0.177861 0.148417 0.192934 0.151695 0.004262 0.028924 -0.005239 0.025412
polarizability: 1.54547255e+02 3.13273997e+00 1.43615571e+02 -2.00631466e+00 -3.82100188e+00 1.24358113e+02
1716.lowfreq: -20.4353 -18.5185 -10.8662 -0.0025 -0.0019 -0.0015 4.9053 32.5857 42.8849
frequency: -9.3337 31.3499 42.2716 51.7079 60.9692 76.8961 111.2890 123.0334 146.0014 169.5776 187.3798 196.1873 209.5678 214.5003 245.1283 256.9794 268.3124 277.6681 299.3350 312.9808 334.1444 386.8155 421.4548 465.2408 488.2939 491.5446 592.6160 668.3726 770.4876 772.2414 780.9926 786.3711 890.7881 906.8428 916.7806 921.7904 1012.7797 1019.7496 1028.6294 1066.8269 1068.4215 1075.9036 1077.2452 1093.1413 1103.1813 1161.1153 1173.1913 1191.7511 1192.4442 1282.7607 1284.9105 1317.0335 1324.4583 1339.0939 1347.9736 1364.6657 1367.9061 1385.2582 1388.4075 1388.9326 1390.1314 1457.4659 1460.6167 1463.8857 1465.0339 1470.2722 1472.7236 1475.5260 1478.2670 1480.8175 1483.1176 1484.8593 1489.8119 2968.8650 2976.4890 2983.7424 2986.8415 2987.7788 2989.3215 3006.3235 3011.0234 3053.4313 3056.3394 3063.5013 3064.8583 3081.4599 3082.0903 3084.4746 3085.3610 3091.8426 3094.2883 3098.1106 3099.0657
redmass: 3.2147 3.3542 2.6747 2.5346 3.2084 2.7671 3.7961 4.5309 1.9501 1.6365 1.5421 1.4872 2.0480 1.4507 2.4543 6.4619 2.6245 1.9028 2.5087 2.6337 2.2422 4.6638 3.0428 7.0796 3.2902 3.2579 3.3717 3.8353 1.1597 1.1737 1.2096 1.2223 2.3290 2.3294 2.1077 2.0452 2.9806 2.8733 4.5585 2.6434 2.5486 1.9310 1.9429 1.7396 1.6873 3.0243 3.2884 1.9517 1.9668 1.1426 1.1551 1.2193 1.2005 1.2248 1.2186 1.2645 1.2956 1.2196 1.2126 1.2121 1.2071 1.0596 1.0531 1.0503 1.0493 1.0476 1.0477 1.0440 1.0517 1.0593 1.0676 1.0579 1.0670 1.0657 1.0653 1.0357 1.0359 1.0363 1.0365 1.0621 1.0623 1.0957 1.0960 1.1005 1.1009 1.0979 1.0988 1.0983 1.0989 1.1015 1.1020 1.1011 1.1021
irintensity: 0.8833 0.5476 0.0802 0.2835 0.9542 1.1232 0.8670 1.2666 2.6829 1.2211 2.8148 0.7028 4.6833 5.1287 2.4091 21.3129 9.1262 9.3974 3.4525 1.2857 2.7208 3.7349 8.1168 77.5559 23.1490 21.1784 40.9203 48.1438 6.2920 17.2410 68.1707 9.5806 15.2384 50.0907 20.7688 24.7893 96.4208 58.9716 80.9812 4.3329 18.6591 6.8456 4.5768 16.0523 11.0919 55.4762 72.3287 19.1787 12.0769 5.8184 15.6453 3.0560 0.6902 4.6058 3.1136 5.1635 10.9841 4.7307 39.8681 7.7482 39.6877 10.8520 5.0723 7.5892 7.9303 5.3153 18.7917 2.7549 14.1750 18.6496 23.9932 8.8804 7.3969 41.9313 21.4248 28.0872 20.8667 22.7590 25.0764 35.3886 33.8487 2.0786 0.2848 2.1415 0.8264 47.8280 24.8257 57.2488 13.3390 43.6657 21.9065 53.0620 21.4646
temp: 298.150 k
press: 1.00000 atm
elementType: 17 15 8 7 7 6 6 6 6 6 6 6 6 1 1 1 1 1 1 1 1 1 1 1 1 1 1 1 1 1 1 1 1
symmnumber: 1
zpe: 734922.4 jmol-1
zpe.correction: 0.279917 hartree
zpe.thermalcorrener: 0.297560 hartree
zpe.thermalcorrenthalpy: 0.298504 hartree
zpe.thermalcorrgfe: 0.233665 hartree
zpe.sumelectzpe: -1301.765465 hartree
zpe.sumelectthermal: -1301.747823 hartree
zpe.sumelectthermalent: -1301.746879 hartree
zpe.sumelectthermalfe: -1301.811718 hartree
dipole: 0.2885 5.2430 0.4464
dipole: 5.2699
quadrupole: -82.7756 -101.8605 -102.4787
quadrupole: -0.2782 -1.2130 -1.4685
quadrupole: 12.9293 -6.1556 -6.7738 -0.2782 -1.2130 -1.4685
hfenergy: -1302.0453825 hartree
pointgroup: C01 [X(C8H20Cl1N2O1P1)]
dipole: 0.0442572 -2.0681149 0.1400923 debye
polarizability: 154.2864944|-3.1045281|142.220601|2.6259715|-6.6530908|126.013843 unknown
InChI: InChI=1S/C8H20N2OP.Cl/c1-5-9(6-2)12(11)10(7-3)8-4;/h5-8H2,1-4H3;
charge 0 multiplicity 1
33 atoms
Cl 0.074828 1.958784 -1.984911
P  -0.047616 0.934334 0.128331
O  -0.037306 2.043845 1.277419
N  -1.417157 -0.108306 -0.13093
N  1.307486 -0.142621 0.207674
C  -1.61999 -1.251114 0.812569
C  -2.646131 0.467686 -0.748004
C  1.54398 -1.0851 -0.920825
C  2.489599 0.333417 0.98445
C  -1.94663 -2.565147 0.076494
C  -3.460039 1.390542 0.18683
C  2.064076 -2.452473 -0.439516
C  3.48507 1.189153 0.171067
H  -0.69599 -1.378906 1.403328
H  -2.432823 -1.004292 1.52665
H  -2.346087 1.016256 -1.657372
H  -3.26176 -0.388384 -1.079696
H  0.584334 -1.21225 -1.451206
H  2.254789 -0.637157 -1.644307
H  2.104285 0.920841 1.836108
H  2.990933 -0.561709 1.396752
H  -2.871678 -2.482691 -0.520934
H  -1.124917 -2.850396 -0.602532
H  -2.094825 -3.37924 0.810532
H  -3.781959 0.864646 1.103925
H  -2.861901 2.268116 0.488935
H  -4.36658 1.749867 -0.334175
H  3.056374 -2.37318 0.038138
H  1.36647 -2.907888 0.285249
H  2.164848 -3.134085 -1.303837
H  3.911404 0.632462 -0.682374
H  2.992288 2.097519 -0.216969
H  4.323127 1.50147 0.820435
