program: Orca
programVersion: 5.0.2
elementType: Cl Cl O O O N C C C C C C C C C C C C C C C C C C C C C C H H H H H H H H H H H H H H H H H H H
charge: 0
multiplicity: 1
keywords: wb97x-d3
keywords: def2-TZVPP
keywords: def2/J RIJCOSX
keywords: DEFGRID2
keywords: scfconv7
keywords: smallprint printgap noloewdin
keywords: NOSOSCF
formula: C22H19Cl2NO3
InChI: InChI=1/C22H19Cl2NO3/c1-22(2)17(12-19(23)24)20(22)21(26)28-18(13-25)14-7-6-10-16(11-14)27-15-8-4-3-5-9-15/h3-12,17-18,20H,1-2H3
47 atoms
Cl -3.540636 0.38443 1.434841
Cl -3.559335 2.087812 3.759641
O  2.315487 1.751258 -0.151952
O  0.632014 0.813897 -1.279401
O  1.385628 -3.787628 -0.453194
N  3.308765 0.689072 -3.257896
C  -0.829648 3.473941 -0.474571
C  -1.290908 2.331461 0.38032
C  0.195883 2.612825 0.236964
C  -1.027604 3.360307 -1.966488
C  -0.952948 4.892354 0.027926
C  -1.921588 2.532465 1.689436
C  1.020331 1.629699 -0.483926
C  -2.875212 1.770497 2.210552
C  3.235156 0.781423 -0.647012
C  3.040093 -0.56284 0.013524
C  3.229882 0.724351 -2.112734
C  2.336335 -1.5900 -0.597121
C  3.540231 -0.726807 1.301808
C  2.093685 -2.762604 0.105981
C  3.321589 -1.916416 1.977273
C  2.586018 -2.935759 1.390328
C  0.246852 -3.488727 -1.157433
C  -0.665281 -2.54086 -0.70735
C  0.012463 -4.199358 -2.325002
C  -1.812999 -2.301732 -1.44833
C  -1.147191 -3.958188 -3.048683
C  -2.060741 -3.00649 -2.618705
H  -1.633797 1.466797 -0.176614
H  0.686016 3.084414 1.08097
H  -0.216989 3.854429 -2.505387
H  -1.957981 3.858008 -2.245662
H  -1.091905 2.333373 -2.318505
H  -1.972715 5.257803 -0.10588
H  -0.289727 5.547835 -0.538911
H  -0.691667 5.002481 1.079873
H  -1.584322 3.366257 2.293576
H  4.212792 1.178577 -0.364526
H  1.965477 -1.483589 -1.608397
H  4.098827 0.071241 1.774946
H  3.714081 -2.049001 2.97678
H  2.394847 -3.857968 1.924521
H  -0.491559 -1.990733 0.209217
H  0.732653 -4.933385 -2.664179
H  -2.520451 -1.559759 -1.101109
H  -1.328278 -4.51265 -3.960472
H  -2.958707 -2.814733 -3.19113
elementType: Cl O N C H
totalener: -2050.68405874 hartree
nucrepener: 2857.48045813 hartree
electener: -4908.16451687 hartree
oneelecener: -8491.23939359 hartree
twoeener: 3583.07487672 hartree
cpcmener: -0.03322963 hartree
kineticenergy: 2044.48008254 hartree
xcener: -151.867215325131 hartree
chargesum: 0.0000000
charge: -0.060319 -0.060507 -0.282596 -0.446660 -0.332675 -0.081525 0.083582 0.026489 -0.070121 -0.264534 -0.270763 -0.197667 0.422541 0.048244 0.463113 -0.028570 -0.249859 -0.137139 -0.232914 0.213824 -0.116662 -0.217433 0.279281 -0.188175 -0.241040 -0.129041 -0.122843 -0.189578 0.074621 0.095778 0.100704 0.097971 0.095481 0.102932 0.098865 0.091670 0.127845 0.144700 0.140404 0.144334 0.159190 0.148426 0.148751 0.144919 0.153015 0.156713 0.157228
qa: -0.0603 -0.0605 -0.2826 -0.4467 -0.3327 -0.0815 0.0836 0.0265 -0.0701 -0.2645 -0.2708 -0.1977 0.4225 0.0482 0.4631 -0.0286 -0.2499 -0.1371 -0.2329 0.2138 -0.1167 -0.2174 0.2793 -0.1882 -0.2410 -0.1290 -0.1228 -0.1896 0.0746 0.0958 0.1007 0.0980 0.0955 0.1029 0.0989 0.0917 0.1278 0.1447 0.1404 0.1443 0.1592 0.1484 0.1488 0.1449 0.1530 0.1567 0.1572
va: 1.2729 1.2441 2.1419 2.0472 2.0777 3.1066 3.7479 3.8892 3.8402 3.9060 3.9099 3.8912 4.1402 4.1995 3.8413 3.6272 4.0662 3.8891 3.9981 3.8278 3.8887 4.0187 3.7081 3.8690 4.0067 3.8765 3.8862 3.9318 1.0340 1.0319 0.9993 1.0000 1.0183 1.0001 1.0010 1.0059 1.0202 0.9924 1.0218 1.0036 0.9888 1.0038 1.0034 1.0077 0.9902 0.9891 0.9909
dispcorr: -0.025920303 hartree
energy: -2050.709979040505
dipole: 11.03452 -10.54812 0.48640 7.06189 -5.41344 1.64845 -15.86524 17.75968 1.89444
magnitude: 2.55791 au
magnitude: 6.50169 debye
