program: Orca
programVersion: 5.0.2
elementType: Cl Cl O O O N C C C C C C C C C C C C C C C C C C C C C C H H H H H H H H H H H H H H H H H H H
charge: 0
multiplicity: 1
keywords: wb97x-d3
keywords: def2-TZVPP
keywords: def2/J RIJCOSX
keywords: DEFGRID2
keywords: scfconv7
keywords: smallprint printgap noloewdin
keywords: NOSOSCF
formula: C22H19Cl2NO3
InChI: InChI=1/C22H19Cl2NO3/c1-22(2)17(12-19(23)24)20(22)21(26)28-18(13-25)14-7-6-10-16(11-14)27-15-8-4-3-5-9-15/h3-12,17-18,20H,1-2H3
47 atoms
Cl -1.979179 5.538825 1.39014
Cl -3.144971 6.355386 -1.118497
O  1.655732 0.947632 -1.327321
O  1.320497 1.724061 0.741688
O  0.033687 -3.531033 0.074014
N  4.110076 -0.444769 -3.037706
C  -1.661514 1.41969 -0.355071
C  -1.295568 2.860219 -0.123111
C  -0.375726 1.980173 -0.936543
C  -1.625884 0.495654 0.837435
C  -2.734106 1.05295 -1.351002
C  -1.994666 3.959647 -0.798895
C  0.927825 1.573479 -0.385217
C  -2.32277 5.11949 -0.244052
C  2.834087 0.293794 -0.880156
C  2.515972 -0.911537 -0.023149
C  3.534625 -0.111178 -2.101127
C  1.457782 -1.737418 -0.376158
C  3.27117 -1.176668 1.109235
C  1.1362 -2.817272 0.432772
C  2.951524 -2.274117 1.895493
C  1.881706 -3.094438 1.573497
C  -0.06405 -4.858729 0.402531
C  0.928097 -5.76357 0.047566
C  -1.216948 -5.280663 1.045932
C  0.756307 -7.106442 0.348729
C  -1.380566 -6.629315 1.331674
C  -0.395651 -7.544732 0.989395
H  -0.947697 3.073847 0.881192
H  -0.387775 2.116732 -2.012346
H  -2.605737 0.488114 1.318642
H  -0.898911 0.789647 1.59164
H  -1.40283 -0.528724 0.531469
H  -2.618745 0.011395 -1.656161
H  -2.708059 1.658995 -2.255876
H  -3.7247 1.158309 -0.904498
H  -2.264169 3.825742 -1.839847
H  3.492104 0.980837 -0.337251
H  0.865017 -1.546484 -1.263058
H  4.092763 -0.527074 1.382746
H  3.529281 -2.483324 2.786028
H  1.630465 -3.92832 2.216266
H  1.822707 -5.428657 -0.463118
H  -1.980866 -4.561567 1.313971
H  1.526934 -7.814446 0.072674
H  -2.2824 -6.961324 1.829543
H  -0.525264 -8.594727 1.216314
elementType: Cl O N C H
totalener: -2050.68613310 hartree
nucrepener: 2712.23965328 hartree
electener: -4762.92578638 hartree
oneelecener: -8199.83721570 hartree
twoeener: 3436.91142932 hartree
cpcmener: -0.03157800 hartree
kineticenergy: 2044.47498737 hartree
xcener: -151.864057942761 hartree
chargesum: -0.0000000
charge: -0.055415 -0.059937 -0.280426 -0.424363 -0.329889 -0.087522 0.096927 0.027027 -0.062726 -0.266667 -0.266209 -0.204319 0.346585 0.040591 0.413271 0.044257 -0.230159 -0.277647 -0.203333 0.275114 -0.128505 -0.181585 0.236358 -0.168919 -0.219362 -0.154353 -0.137391 -0.164882 0.079680 0.100654 0.105655 0.097059 0.091474 0.099312 0.091732 0.102085 0.130379 0.143756 0.137028 0.144242 0.160250 0.158085 0.158704 0.147887 0.158892 0.158094 0.158509
qa: -0.0554 -0.0599 -0.2804 -0.4244 -0.3299 -0.0875 0.0969 0.0270 -0.0627 -0.2667 -0.2662 -0.2043 0.3466 0.0406 0.4133 0.0443 -0.2302 -0.2776 -0.2033 0.2751 -0.1285 -0.1816 0.2364 -0.1689 -0.2194 -0.1544 -0.1374 -0.1649 0.0797 0.1007 0.1057 0.0971 0.0915 0.0993 0.0917 0.1021 0.1304 0.1438 0.1370 0.1442 0.1602 0.1581 0.1587 0.1479 0.1589 0.1581 0.1585
va: 1.2701 1.2445 2.1169 2.0863 2.0482 3.1121 3.7371 3.8913 3.8081 3.9031 3.9031 3.9005 4.2597 4.2123 3.7116 3.5874 4.0820 4.0320 3.9922 3.7201 3.9121 3.9191 3.7356 3.9165 3.9948 3.8982 3.8931 3.8887 1.0485 1.0314 1.0017 1.0158 1.0031 1.0017 1.0055 1.0010 1.0184 1.0141 1.0278 1.0029 0.9904 0.9960 0.9962 1.0049 0.9905 0.9899 0.9899
dispcorr: -0.024530035 hartree
energy: -2050.710663134081
dipole: 1.73530 -2.64912 -0.91382 -42.73136 41.25591 -1.47546 4.01532 -3.12025 0.89507
magnitude: 1.95274 au
magnitude: 4.96347 debye
