program: Orca
programVersion: 5.0.2
elementType: Cl Cl O O O N C C C C C C C C C C C C C C C C C C C C C C H H H H H H H H H H H H H H H H H H H
charge: 0
multiplicity: 1
keywords: wb97x-d3
keywords: def2-TZVPP
keywords: def2/J RIJCOSX
keywords: DEFGRID2
keywords: scfconv7
keywords: smallprint printgap noloewdin
keywords: NOSOSCF
formula: C22H19Cl2NO3
InChI: InChI=1/C22H19Cl2NO3/c1-22(2)17(12-19(23)24)20(22)21(26)28-18(13-25)14-7-6-10-16(11-14)27-15-8-4-3-5-9-15/h3-12,17-18,20H,1-2H3
47 atoms
Cl -2.28721 -0.119592 -0.677448
Cl -4.335996 0.902808 1.075655
O  2.073307 2.071778 -0.333484
O  2.234549 2.220011 1.886006
O  0.368153 -2.649407 -1.088702
N  4.152362 1.32703 -2.787627
C  -0.279067 3.973873 -0.249013
C  -0.800971 2.58192 -0.060695
C  0.310774 3.111721 0.845226
C  0.470241 4.284016 -1.523839
C  -1.090834 5.152048 0.237738
C  -2.10635 2.284268 0.538387
C  1.623448 2.44477 0.872392
C  -2.80585 1.174658 0.33191
C  3.201658 1.207243 -0.357353
C  2.810627 -0.208657 -0.008465
C  3.720805 1.286359 -1.724187
C  1.748924 -0.804286 -0.680007
C  3.480621 -0.892046 0.994003
C  1.371293 -2.09498 -0.350432
C  3.096354 -2.189072 1.307741
C  2.046859 -2.799373 0.641339
C  -0.622418 -3.385911 -0.501219
C  -1.094506 -3.132874 0.781047
C  -1.196593 -4.379467 -1.283109
C  -2.143807 -3.894278 1.276437
C  -2.251933 -5.123615 -0.777736
C  -2.72681 -4.890892 0.505999
H  -0.46803 1.875776 -0.812101
H  -0.003201 3.382978 1.846744
H  0.890376 3.407814 -2.010401
H  1.278687 4.99386 -1.340371
H  -0.21645 4.747076 -2.234996
H  -1.884561 5.389519 -0.472789
H  -0.452235 6.032482 0.32732
H  -1.549948 4.988865 1.212263
H  -2.538244 3.013129 1.213819
H  3.992709 1.562049 0.310795
H  1.217025 -0.279831 -1.465541
H  4.297563 -0.420543 1.524892
H  3.6207 -2.732838 2.082204
H  1.764094 -3.814431 0.890289
H  -0.665679 -2.347883 1.390474
H  -0.823254 -4.560025 -2.283578
H  -2.511563 -3.695943 2.275028
H  -2.699072 -5.894096 -1.392632
H  -3.546817 -5.476365 0.900294
elementType: Cl O N C H
totalener: -2050.68273724 hartree
nucrepener: 2891.87516757 hartree
electener: -4942.55790481 hartree
oneelecener: -8559.26452811 hartree
twoeener: 3616.70662330 hartree
cpcmener: -0.03205609 hartree
kineticenergy: 2044.47152036 hartree
xcener: -151.864985410891 hartree
chargesum: -0.0000000
charge: -0.057431 -0.060380 -0.275891 -0.435240 -0.321130 -0.084864 0.103871 0.010872 -0.059454 -0.258116 -0.284203 -0.201646 0.378051 0.058299 0.388425 0.018850 -0.233834 -0.233608 -0.184682 0.243062 -0.122371 -0.182532 0.318972 -0.227508 -0.262306 -0.140825 -0.119511 -0.188719 0.087819 0.095635 0.090704 0.101815 0.095277 0.103565 0.100231 0.093412 0.127763 0.140189 0.140973 0.146260 0.160381 0.157889 0.151500 0.145875 0.158876 0.157773 0.157912
qa: -0.0574 -0.0604 -0.2759 -0.4352 -0.3211 -0.0849 0.1039 0.0109 -0.0595 -0.2581 -0.2842 -0.2016 0.3781 0.0583 0.3884 0.0188 -0.2338 -0.2336 -0.1847 0.2431 -0.1224 -0.1825 0.3190 -0.2275 -0.2623 -0.1408 -0.1195 -0.1887 0.0878 0.0956 0.0907 0.1018 0.0953 0.1036 0.1002 0.0934 0.1278 0.1402 0.1410 0.1463 0.1604 0.1579 0.1515 0.1459 0.1589 0.1578 0.1579
va: 1.2751 1.2449 2.1234 2.0759 2.0615 3.1075 3.7412 3.8791 3.8190 3.9003 3.9233 3.9117 4.2148 4.1977 3.7680 3.6284 4.0700 4.0361 3.9728 3.7950 3.8920 3.9332 3.5901 3.8829 4.0192 3.9017 3.8880 3.9118 1.0251 1.0281 1.0125 1.0010 1.0002 0.9994 1.0003 1.0053 1.0215 1.0156 1.0248 1.0034 0.9901 0.9947 1.0046 1.0090 0.9898 0.9891 0.9903
dispcorr: -0.027097609 hartree
energy: -2050.709834849124
dipole: 9.46544 -10.23014 -0.76469 8.25745 -7.72532 0.53213 1.50647 -0.17238 1.33408
magnitude: 1.62717 au
magnitude: 4.13594 debye
