program: Gaussian 09
title: 000074521
version: EM64L-G09RevD.01
frameworkgroup: C1[X(C10H11F3N2O3S)]
method: RPBEPBE
basis: SDD
operation: Freq
keyword: #p
keyword: freq=noraman
keyword: PBEPBE/SDD
title: #p freq=noraman PBEPBE/SDD
converged: YES YES NO NO
title: Mulliken charges:
elementType: S F F F O O O N N C C C C C C C C C C H H H H H H H H H H H
charge: 0.940492 -0.169272 -0.169593 -0.160271 -0.505436 -0.512999 -0.463533 -0.154699 -0.433651 0.560389 -0.296088 -0.433851 -0.434179 -0.391471 -0.307806 0.320376 -0.344292 -0.294916 0.253486 0.302490 0.291714 0.258309 0.230407 0.314682 0.303739 0.240184 0.261430 0.209293 0.221703 0.363363
chargesum: 0.00000
title: Mulliken charges with hydrogens summed into heavy atoms:
elementType: S F F F O O O N N C C C C C C C C C C
charge: 0.940492 -0.169272 -0.169593 -0.160271 -0.505436 -0.512999 -0.100170 -0.154699 -0.118969 0.560389 -0.296088 0.160353 0.054537 -0.087732 -0.067622 0.320376 -0.082862 0.136081 0.253486
polarizability: 2.08127945e+02 -2.32814224e+00 1.68531955e+02 -6.75329849e+00 6.60516244e+00 1.08525285e+02
1716.lowfreq: -1.9633 -0.0013 -0.0010 0.0012 5.7649 10.4267 15.5370 25.2685 38.8172
frequency: 15.4903 25.1186 38.7623 75.1323 96.3327 109.8931 113.3412 141.6717 183.2633 196.5035 205.0180 226.8324 247.9249 276.2198 284.3450 300.4290 332.5837 353.3431 366.9772 370.7159 390.3466 418.0050 447.2865 467.8264 471.2693 477.4646 502.4515 524.4575 562.4534 597.6183 602.9103 653.4945 661.5622 706.8661 731.9386 768.9306 809.8792 829.8942 847.2787 904.4558 909.0122 935.5065 956.3894 959.2976 973.3028 990.5571 1016.2474 1029.0764 1032.2516 1046.0504 1078.4820 1092.7580 1111.2923 1177.9945 1197.9633 1214.7700 1232.8244 1263.9242 1282.3030 1300.8088 1312.3872 1350.8121 1356.2493 1365.5915 1399.9262 1410.5082 1431.7259 1440.5457 1475.7735 1484.7234 1527.2047 1543.0641 1630.5794 2954.5192 3005.2593 3008.7739 3023.7720 3073.0631 3096.7748 3152.9840 3155.8098 3180.7828 3409.0777 3586.2147
redmass: 14.9689 5.7599 6.3786 6.6713 6.7753 7.1755 6.8788 4.1944 5.6775 6.5316 4.4177 8.0118 6.2367 3.2210 1.4840 5.7955 4.8962 4.6698 5.9640 4.8935 4.3957 10.4783 3.9392 4.7723 3.3539 6.5539 4.0111 5.6608 6.7062 3.5103 3.6492 8.3121 6.8719 1.7284 3.7360 7.1045 1.5507 12.2908 2.7415 2.0542 1.4868 3.7646 4.6872 1.4994 8.1399 6.8354 2.5588 8.7121 3.4793 2.5536 3.8200 1.9848 2.9811 1.2646 1.2059 1.2174 1.2229 1.8120 1.3825 2.0739 1.3463 1.8661 1.2339 1.9698 1.3920 1.8309 2.5105 1.3133 1.0816 1.2041 3.0029 7.6211 6.5923 1.0559 1.0640 1.0873 1.0795 1.1033 1.1015 1.0893 1.0925 1.0943 1.0759 1.0668
irintensity: 0.5349 0.8156 0.6151 0.1770 3.3605 3.9689 0.7729 9.0927 5.2453 0.4285 6.2207 3.7847 4.1146 23.0872 142.9317 4.6184 12.4607 5.8037 12.2712 8.3083 23.1400 38.5076 13.4393 102.4063 43.4185 1.3530 16.8233 8.4129 10.3183 10.1436 0.7678 2.9443 1.4647 84.0153 4.2875 43.3701 48.0919 126.9492 19.1496 17.2679 56.6957 51.6277 37.8885 21.5506 213.5294 146.2905 63.2233 105.2488 4.4000 97.6302 36.3494 6.7550 35.2457 7.1850 40.3877 11.3035 98.8916 217.5659 38.9899 289.2764 1.0012 21.4731 8.4963 47.5883 1.5686 22.6111 5.7301 18.1096 8.2736 10.2754 93.0298 22.7309 235.5342 48.3236 12.6871 6.7414 87.8988 11.1973 2.0158 2.1039 5.5551 11.5285 16.8870 9.4096
temp: 298.150 k
press: 1.00000 atm
elementType: 16 9 9 9 8 8 8 7 7 6 6 6 6 6 6 6 6 6 6 1 1 1 1 1 1 1 1 1 1 1
symmnumber: 1
zpe: 547370.6 jmol-1
zpe.correction: 0.208482 hartree
zpe.thermalcorrener: 0.227056 hartree
zpe.thermalcorrenthalpy: 0.228000 hartree
zpe.thermalcorrgfe: 0.159922 hartree
zpe.sumelectzpe: -1418.798888 hartree
zpe.sumelectthermal: -1418.780314 hartree
zpe.sumelectthermalent: -1418.779370 hartree
zpe.sumelectthermalfe: -1418.847448 hartree
dipole: 6.1718 -9.2937 0.5425
dipole: 11.1695
quadrupole: -122.8247 -122.9424 -118.5807
quadrupole: -18.8976 5.2477 -0.4766
quadrupole: -1.3754 -1.4932 2.8686 -18.8976 5.2477 -0.4766
hfenergy: -1419.00737 hartree
pointgroup: C01 [X(C10H11F3N2O3S1)]
dipole: 2.6050518 -3.5148773 0.412612 debye
polarizability: 207.9473204|-0.9273701|168.9881233|-8.9561429|2.0105039|108.2497408 unknown
InChI: InChI=1S/C10H11F3N2O3S/c11-10(12,13)7-1-2-8-9(5-7)19(17,18)14-6-15(8)3-4-16/h1-2,5,14,16H,3-4,6H2
charge 0 multiplicity 1
30 atoms
S  0.814569 2.442282 -0.182148
F  -4.277256 -1.313642 -0.730598
F  -3.936654 -1.029227 1.48492
F  -4.206241 0.784867 0.148735
O  1.091447 2.990677 -1.681646
O  0.134681 3.370324 0.95811
O  4.148758 -1.453797 1.22354
N  2.122203 -0.426648 -0.604055
N  2.477917 1.833054 0.417281
C  0.744814 -0.422368 -0.43223
C  -0.032787 0.770016 -0.224521
C  2.955107 0.829549 -0.526348
C  2.878281 -1.678208 -0.800148
C  -1.417427 0.776725 -0.016982
C  -0.02001 -1.641839 -0.428361
C  -2.123575 -0.441356 -0.032513
C  -1.4066 -1.646198 -0.248617
C  3.250971 -2.380059 0.51596
C  -3.597087 -0.486069 0.207044
H  3.000677 1.305617 -1.524438
H  3.964794 0.526583 -0.208593
H  3.814748 -1.429981 -1.331215
H  2.32135 -2.37283 -1.45331
H  2.3814 1.519439 1.398816
H  -1.935174 1.724609 0.164641
H  0.484917 -2.599354 -0.572385
H  -1.944618 -2.599512 -0.270538
H  3.764341 -3.337078 0.283476
H  2.343801 -2.591586 1.117866
H  4.430852 -1.841989 2.088158
