program: Orca
programVersion: 5.0.2
elementType: Cl Cl O O O N C C C C C C C C C C C C C C C C C C C C C C H H H H H H H H H H H H H H H H H H H
charge: 0
multiplicity: 1
keywords: wb97x-d3
keywords: def2-TZVPP
keywords: def2/J RIJCOSX
keywords: DEFGRID2
keywords: scfconv7
keywords: smallprint printgap noloewdin
keywords: NOSOSCF
formula: C22H19Cl2NO3
InChI: InChI=1/C22H19Cl2NO3/c1-22(2)17(12-19(23)24)20(22)21(26)28-18(13-25)14-7-6-10-16(11-14)27-15-8-4-3-5-9-15/h3-12,17-18,20H,1-2H3
47 atoms
Cl -0.825632 4.330797 -1.455197
Cl -3.644906 4.869286 -1.784825
O  1.2123 0.527182 -0.874116
O  1.230629 1.679684 1.047514
O  1.450839 -3.844383 1.652786
N  3.463457 0.307342 -3.267797
C  -1.835723 0.803295 0.917602
C  -1.678794 2.262555 0.65862
C  -0.829292 1.291235 -0.120745
C  -1.365349 0.252785 2.239726
C  -3.030039 0.075322 0.352679
C  -2.71343 3.044214 -0.054717
C  0.619563 1.221788 0.118672
C  -2.432859 3.958074 -0.972289
C  2.603368 0.300588 -0.799604
C  2.954077 -1.02117 -0.137044
C  3.069871 0.310257 -2.188953
C  1.971252 -1.820837 0.427078
C  4.288494 -1.407504 -0.100984
C  2.336163 -3.02377 1.024105
C  4.633512 -2.610661 0.493004
C  3.663926 -3.427028 1.05158
C  0.110359 -3.815441 1.374445
C  -0.374895 -3.880826 0.074265
C  -0.758471 -3.795641 2.456152
C  -1.746112 -3.913955 -0.134293
C  -2.12751 -3.844258 2.233075
C  -2.627094 -3.897021 0.939551
H  -1.149257 2.816865 1.430096
H  -1.121318 1.106616 -1.148397
H  -0.53824 0.814639 2.66909
H  -1.054511 -0.789544 2.142736
H  -2.185214 0.282734 2.959949
H  -3.338835 0.462352 -0.618966
H  -3.882775 0.150181 1.030255
H  -2.802663 -0.984753 0.226587
H  -3.754996 2.881297 0.198763
H  3.113387 1.119271 -0.279793
H  0.932022 -1.522699 0.406964
H  5.056451 -0.779676 -0.536619
H  5.669736 -2.92089 0.517327
H  3.932752 -4.367995 1.51487
H  0.303281 -3.910247 -0.769539
H  -0.364442 -3.751375 3.463913
H  -2.125533 -3.961893 -1.146791
H  -2.8037 -3.834631 3.078255
H  -3.695034 -3.92862 0.768147
elementType: Cl O N C H
totalener: -2050.68297536 hartree
nucrepener: 2844.04190608 hartree
electener: -4894.72488144 hartree
oneelecener: -8463.08495831 hartree
twoeener: 3568.36007687 hartree
cpcmener: -0.02964002 hartree
kineticenergy: 2044.46213751 hartree
xcener: -151.864856371705 hartree
chargesum: -0.0000000
charge: -0.049209 -0.055043 -0.280715 -0.430054 -0.320104 -0.088508 0.163864 -0.029203 -0.154963 -0.253372 -0.284564 -0.221350 0.383536 0.073693 0.399021 0.035350 -0.220448 -0.217537 -0.262932 0.339108 -0.095233 -0.260673 0.299968 -0.215627 -0.240069 -0.119755 -0.115630 -0.201447 0.113017 0.114330 0.101097 0.062033 0.104864 0.099372 0.104793 0.085436 0.139998 0.140951 0.127606 0.147331 0.158192 0.145832 0.157375 0.144303 0.160339 0.156987 0.158044
qa: -0.0492 -0.0550 -0.2807 -0.4301 -0.3201 -0.0885 0.1639 -0.0292 -0.1550 -0.2534 -0.2846 -0.2214 0.3835 0.0737 0.3990 0.0353 -0.2204 -0.2175 -0.2629 0.3391 -0.0952 -0.2607 0.3000 -0.2156 -0.2401 -0.1198 -0.1156 -0.2014 0.1130 0.1143 0.1011 0.0620 0.1049 0.0994 0.1048 0.0854 0.1400 0.1410 0.1276 0.1473 0.1582 0.1458 0.1574 0.1443 0.1603 0.1570 0.1580
va: 1.2810 1.2510 2.1044 2.0783 2.0989 3.1110 3.6735 3.8900 3.8390 3.8806 3.9161 3.9082 4.1595 4.1877 3.7045 3.6900 4.0413 3.9595 4.0142 3.6885 3.8948 4.0110 3.6497 3.9188 3.9678 3.8203 3.8303 3.8658 1.0222 1.0257 1.0204 1.0147 1.0031 1.0012 0.9999 1.0132 1.0086 1.0232 1.0102 1.0038 0.9893 1.0082 0.9957 1.0092 0.9894 0.9893 0.9917
dispcorr: -0.027778534 hartree
energy: -2050.710753898840
dipole: -3.09812 1.46005 -1.63807 -32.45669 31.37138 -1.08531 19.17387 -17.61893 1.55494
magnitude: 2.50579 au
magnitude: 6.36922 debye
