program: Orca
programVersion: 5.0.2
elementType: Cl Cl O O O N C C C C C C C C C C C C C C C C C C C C C C H H H H H H H H H H H H H H H H H H H
charge: 0
multiplicity: 1
keywords: wb97x-d3
keywords: def2-TZVPP
keywords: def2/J RIJCOSX
keywords: DEFGRID2
keywords: scfconv7
keywords: smallprint printgap noloewdin
keywords: NOSOSCF
formula: C22H19Cl2NO3
InChI: InChI=1/C22H19Cl2NO3/c1-22(2)17(12-19(23)24)20(22)21(26)28-18(13-25)14-7-6-10-16(11-14)27-15-8-4-3-5-9-15/h3-12,17-18,20H,1-2H3
47 atoms
Cl -1.547908 5.660951 -0.176435
Cl -3.884428 5.135711 -1.783811
O  1.066462 0.11548 -1.364412
O  1.501037 1.677294 0.173593
O  1.851696 -4.13503 1.529335
N  2.808422 -1.586204 -3.594038
C  -1.555468 1.236147 0.803231
C  -1.353385 2.522148 0.057653
C  -0.760034 1.237151 -0.489293
C  -0.858707 1.078459 2.132576
C  -2.88962 0.532296 0.752139
C  -2.43117 3.165393 -0.702651
C  0.703142 1.072466 -0.494337
C  -2.590516 4.473431 -0.858675
C  2.44745 -0.22632 -1.393236
C  2.8457 -1.062512 -0.200151
C  2.630867 -0.981542 -2.634099
C  2.129197 -2.219693 0.085406
C  3.903777 -0.664546 0.601363
C  2.476191 -2.971256 1.198478
C  4.25119 -1.438444 1.700363
C  3.53744 -2.583211 2.009317
C  0.533596 -4.335347 1.210722
C  0.195692 -5.549304 0.63219
C  -0.443317 -3.394395 1.51361
C  -1.136717 -5.826787 0.359254
C  -1.769331 -3.680569 1.224059
C  -2.122616 -4.894447 0.648837
H  -0.631578 3.193043 0.509423
H  -1.267303 0.790318 -1.336791
H  -0.575351 0.037351 2.301971
H  -1.539893 1.367383 2.934952
H  0.033962 1.691696 2.229967
H  -3.590393 0.989402 1.453327
H  -2.771492 -0.514835 1.037866
H  -3.346757 0.545945 -0.236539
H  -3.156339 2.527354 -1.193455
H  3.07664 0.667161 -1.455785
H  1.315229 -2.530983 -0.559309
H  4.451645 0.240527 0.372413
H  5.075335 -1.137551 2.333404
H  3.800009 -3.180928 2.873128
H  0.968425 -6.272855 0.404442
H  -0.179981 -2.450093 1.974985
H  -1.40026 -6.776406 -0.088393
H  -2.531934 -2.948969 1.459082
H  -3.159806 -5.112193 0.430424
elementType: Cl O N C H
totalener: -2050.68645803 hartree
nucrepener: 2771.09611784 hartree
electener: -4821.78257588 hartree
oneelecener: -8317.10092890 hartree
twoeener: 3495.31835302 hartree
cpcmener: -0.03239787 hartree
kineticenergy: 2044.47192830 hartree
xcener: -151.863844733620 hartree
chargesum: 0.0000000
charge: -0.054745 -0.059723 -0.281452 -0.437535 -0.325245 -0.086494 0.085156 0.023902 -0.056902 -0.258826 -0.266215 -0.204592 0.371545 0.042477 0.416769 0.018399 -0.233293 -0.202680 -0.203766 0.255741 -0.108238 -0.238204 0.263437 -0.227439 -0.202075 -0.128626 -0.161495 -0.173787 0.080983 0.098319 0.091298 0.100866 0.098332 0.104114 0.087484 0.093689 0.129173 0.139833 0.146407 0.145310 0.158628 0.147676 0.146085 0.179348 0.158022 0.171118 0.157219
qa: -0.0547 -0.0597 -0.2815 -0.4375 -0.3252 -0.0865 0.0852 0.0239 -0.0569 -0.2588 -0.2662 -0.2046 0.3715 0.0425 0.4168 0.0184 -0.2333 -0.2027 -0.2038 0.2557 -0.1082 -0.2382 0.2634 -0.2274 -0.2021 -0.1286 -0.1615 -0.1738 0.0810 0.0983 0.0913 0.1009 0.0983 0.1041 0.0875 0.0937 0.1292 0.1398 0.1464 0.1453 0.1586 0.1477 0.1461 0.1793 0.1580 0.1711 0.1572
va: 1.2710 1.2450 2.1320 2.0767 2.0873 3.1129 3.7401 3.8893 3.8251 3.8998 3.9152 3.9049 4.2202 4.2152 3.7346 3.6046 4.0842 3.9347 3.9688 3.7645 3.9008 4.0078 3.7337 4.0030 3.9240 3.8902 3.8998 3.9167 1.0484 1.0318 1.0027 1.0012 1.0181 1.0011 1.0072 1.0061 1.0199 1.0165 1.0156 1.0047 0.9892 1.0057 1.0074 0.9776 0.9891 0.9838 0.9915
dispcorr: -0.025286827 hartree
energy: -2050.711744858400
dipole: 2.09628 -3.18684 -1.09056 -32.59483 32.11311 -0.48172 17.13873 -15.65481 1.48392
magnitude: 1.90352 au
magnitude: 4.83837 debye
