program: Gaussian 09
title: 000074510
version: EM64L-G09RevD.01
frameworkgroup: C1[X(C8H11NS)]
method: RPBEPBE
basis: SDD
operation: Freq
keyword: #p
keyword: freq=noraman
keyword: PBEPBE/SDD
title: #p freq=noraman PBEPBE/SDD
converged: YES YES NO NO
title: Mulliken charges:
elementType: S N C C C C C C C C H H H H H H H H H H H
charge: 0.151910 -0.704162 -0.116790 -0.459198 0.519034 -0.592908 -0.278830 -0.425547 -0.184264 -0.647777 0.246962 0.257339 0.259415 0.246946 0.217245 0.220436 0.227992 0.228845 0.219971 0.305086 0.308295
chargesum: 0.00000
title: Mulliken charges with hydrogens summed into heavy atoms:
elementType: S N C C C C C C C C
charge: 0.151910 -0.090780 -0.116790 -0.212236 0.519034 -0.076155 -0.031884 -0.208302 0.036172 0.029030
polarizability: 1.60880389e+02 4.25809976e+00 1.09502121e+02 -4.50442377e+00 1.86217898e+00 6.68437132e+01
1716.lowfreq: -12.2456 -0.0031 -0.0013 -0.0012 1.1244 7.1614 15.3576 42.7389 83.3875
frequency: 13.9442 42.7136 83.3244 208.8647 216.4884 223.2668 236.1185 273.6431 352.9156 369.3742 400.6066 417.7650 449.0976 525.1674 578.2246 625.1761 672.3734 688.8839 779.4721 784.2544 868.7819 869.7628 873.7326 961.1719 975.6346 994.2134 1019.4523 1026.3484 1067.1008 1068.1951 1107.4193 1174.5944 1232.2796 1267.1634 1277.6244 1318.2325 1383.8439 1394.3474 1440.0215 1460.0158 1469.1322 1476.8838 1483.8063 1574.8058 1616.2339 1641.6771 2983.8272 3023.4643 3076.8537 3078.3571 3105.9424 3117.9332 3134.8717 3139.6123 3163.3885 3568.1132 3708.6849
redmass: 4.0597 1.8888 3.7877 4.4363 3.5811 3.3049 1.2580 3.5703 1.2400 1.0474 2.8753 6.7336 3.1209 6.1865 4.7576 4.4606 7.1456 1.9203 1.4398 1.1443 1.7028 3.1956 1.5816 1.3333 5.8530 1.7922 1.4988 1.1893 2.3014 2.0764 1.3629 1.0755 1.2536 1.3114 1.4202 1.9566 7.7381 1.2071 3.0331 1.0931 1.0432 2.9345 1.0494 6.5263 4.6558 1.2418 1.0353 1.0576 1.1023 1.0986 1.1070 1.0867 1.0918 1.0926 1.0978 1.0449 1.1040
irintensity: 2.2195 0.1752 0.9698 5.5174 4.1333 1.4652 0.3615 1.7934 307.8385 5.8500 2.6234 0.0739 4.9224 0.2281 0.9620 3.4820 1.0678 28.5959 43.1603 19.3080 7.8134 21.6197 29.7890 1.2282 15.3670 19.8493 2.4227 0.9787 8.1477 3.5921 6.6169 5.9246 0.1515 17.3086 16.0926 26.9490 17.1184 18.8167 7.7177 4.6652 16.7240 69.3502 8.5237 31.3676 133.2360 232.5022 38.6904 18.2729 5.1918 28.6764 42.3915 11.3548 12.9350 23.8310 11.6492 63.9515 20.0020
temp: 298.150 k
press: 1.00000 atm
elementType: 16 7 6 6 6 6 6 6 6 6 1 1 1 1 1 1 1 1 1 1 1
symmnumber: 1
zpe: 449109.2 jmol-1
zpe.correction: 0.171057 hartree
zpe.thermalcorrener: 0.182058 hartree
zpe.thermalcorrenthalpy: 0.183002 hartree
zpe.thermalcorrgfe: 0.132594 hartree
zpe.sumelectzpe: -763.513232 hartree
zpe.sumelectthermal: -763.502231 hartree
zpe.sumelectthermalent: -763.501287 hartree
zpe.sumelectthermalfe: -763.551696 hartree
dipole: -1.9640 -0.8362 1.9818
dipole: 2.9128
quadrupole: -51.5461 -59.8261 -73.0243
quadrupole: 5.6224 0.9709 -0.4141
quadrupole: 9.9194 1.6394 -11.5588 5.6224 0.9709 -0.4141
hfenergy: -763.6842892 hartree
pointgroup: C01 [X(C8H11N1S1)]
dipole: -0.7220744 -0.6505895 0.6071143 debye
dipolederiv: -0.3308299 0.0049447 -0.0728466 -0.0518411 -0.1735793 0.0080662 -0.1627306 -0.0016256 -0.0305591 -0.7974947 -0.5976449 -0.2710594 -0.6991898 -0.9869257 0.075969 -0.2630858 0.0885148 -0.6419084 0.6270589 0.0803671 -0.0715643 -0.0977113 0.3011042 0.1357766 -0.1544252 0.1137668 -0.0811629 -0.5129659 -0.4168228 -0.1383264 0.086978 -0.1496697 0.0215394 0.0793648 0.1396107 -0.161412 0.7256621 0.7663394 0.1854895 0.8303234 0.9247852 0.1096987 0.1626032 0.094881 0.1649645 0.2066636 -0.0169833 0.2215647 0.0246179 0.1342602 -0.0396494 0.3774227 -0.0434251 0.2116568 -0.4726983 0.1076656 0.0559069 0.0386584 -0.2029056 -0.0258089 0.1278169 -0.0518347 -0.2365971 -0.052594 0.0671813 -0.0525721 -0.3847385 -0.3493125 0.055192 -0.2099079 -0.0597537 -0.2151006 0.3024609 -0.0198503 -0.1123694 0.192744 0.1299713 0.0495706 -0.04152 0.1067181 -0.0594161 -0.1279788 0.0074021 0.013878 0.0298864 0.0754727 0.0034228 -0.2177312 0.0185707 0.0152058 0.0913619 0.0270853 0.0384867 0.0222921 -0.0427406 -0.0808576 0.0329189 -0.0833099 0.1170228 0.0149431 0.0675609 -0.0027412 0.0531507 -0.0422925 -0.0955495 -0.0171741 -0.0711375 -0.0665318 -0.0111149 -0.0579526 0.0026105 -0.0382615 -0.0483592 0.1034798 -0.050265 0.0911227 -0.0594053 0.0286717 -0.1075073 0.0071973 -0.0903012 0.0083205 -0.0367215 0.0147413 -0.032586 0.1423603 -0.141138 -0.0027738 0.0814777 -0.0259066 0.087322 -0.0271118 0.0775464 -0.0365061 0.1369467 0.0388365 0.0595884 0.0477183 0.0720472 -0.0636386 -0.0984447 0.0528761 -0.1023111 0.0983553 0.0804724 0.0195573 0.0141211 0.0703459 -0.0605975 -0.1027204 0.0939412 -0.1153004 0.0347338 0.0740534 -0.0379296 0.025194 -0.0945047 -0.0672655 0.0907575 0.0967825 0.0964274 0.0510478 -0.0842989 0.0169469 -0.1141392 0.0149696 0.116265 0.0150214 -0.1369529 0.0156357 -0.0846892 0.1830492 0.0246057 0.0695486 0.0136519 0.1902398 -0.0862144 0.061232 -0.0909093 0.331994 0.1578797 0.0082199 0.0724255 0.0327892 0.2195456 -0.0754158 0.0765464 -0.0765483 0.3324947 unknown
polarizability: 159.5567802|10.3343041|104.0411676|-3.7948103|15.4697044|73.6282754 unknown
InChI: InChI=1S/C8H11NS/c1-2-10-8-5-3-4-7(9)6-8/h3-6H,2,9H2,1H3
charge 0 multiplicity 1
21 atoms
S  1.980383 -0.078922 -1.028919
N  -2.877654 -1.980224 -0.359604
C  0.240702 0.075232 -0.41726
C  -0.640325 -1.009645 -0.598815
C  -1.999211 -0.910137 -0.176148
C  2.895607 -0.197184 0.643441
C  -0.197704 1.279033 0.185173
C  -2.438613 0.296734 0.442285
C  -1.541406 1.370047 0.617172
C  4.406633 -0.269412 0.384431
H  -0.273052 -1.931614 -1.063953
H  2.624001 0.694176 1.233125
H  2.523219 -1.097411 1.160144
H  0.487762 2.125133 0.292029
H  -3.479296 0.388754 0.777004
H  -1.896821 2.29526 1.085444
H  4.667324 -1.153746 -0.224286
H  4.764637 0.630955 -0.146085
H  4.952293 -0.342371 1.343555
H  -3.845723 -1.915996 -0.059914
H  -2.569558 -2.835261 -0.81252
