program: Orca
programVersion: 5.0.2
elementType: Cl Cl O O O N C C C C C C C C C C C C C C C C C C C C C C H H H H H H H H H H H H H H H H H H H
charge: 0
multiplicity: 1
keywords: wb97x-d3
keywords: def2-TZVPP
keywords: def2/J RIJCOSX
keywords: DEFGRID2
keywords: scfconv7
keywords: smallprint printgap noloewdin
keywords: NOSOSCF
formula: C22H19Cl2NO3
InChI: InChI=1/C22H19Cl2NO3/c1-22(2)17(12-19(23)24)20(22)21(26)28-18(13-25)14-7-6-10-16(11-14)27-15-8-4-3-5-9-15/h3-12,17-18,20H,1-2H3
47 atoms
Cl -4.098357 0.867936 -0.482044
Cl -4.513373 1.124328 2.36078
O  2.394698 1.546481 0.309108
O  1.060153 1.003216 -1.399511
O  1.563568 -3.734822 -0.219309
N  3.975084 0.998856 -2.754331
C  -0.633964 3.384238 -0.202681
C  -1.259166 2.050453 0.086132
C  0.197781 2.281924 0.428396
C  -0.431666 3.77086 -1.646424
C  -0.949145 4.559677 0.690064
C  -2.222029 1.855923 1.179924
C  1.21922 1.544275 -0.335668
C  -3.439643 1.348934 1.03386
C  3.497012 0.799572 -0.193795
C  3.462592 -0.64443 0.251366
C  3.687663 0.924884 -1.644008
C  2.524678 -1.536867 -0.255395
C  4.374027 -1.065093 1.212673
C  2.477065 -2.831581 0.240044
C  4.341781 -2.375805 1.66669
C  3.387553 -3.262424 1.195435
C  0.285829 -3.306064 -0.478121
C  -0.408634 -2.506149 0.422407
C  -0.311021 -3.73533 -1.65317
C  -1.710617 -2.129269 0.129675
C  -1.61963 -3.360548 -1.927305
C  -2.321169 -2.552112 -1.044462
H  -1.423491 1.435689 -0.792034
H  0.437183 2.433486 1.475083
H  -0.323748 2.917023 -2.311643
H  0.451327 4.402754 -1.760187
H  -1.293315 4.34451 -1.992522
H  -1.900764 5.010129 0.401902
H  -0.177429 5.325388 0.594414
H  -1.013416 4.290533 1.743883
H  -1.923596 2.139268 2.18251
H  4.369153 1.279825 0.255898
H  1.8332 -1.23518 -1.029798
H  5.109542 -0.374364 1.605473
H  5.056408 -2.705569 2.409096
H  3.346455 -4.279594 1.564134
H  0.054779 -2.179279 1.345122
H  0.242435 -4.358084 -2.344812
H  -2.251243 -1.508222 0.832874
H  -2.086318 -3.696378 -2.844307
H  -3.337968 -2.257093 -1.266378
elementType: Cl O N C H
totalener: -2050.68222932 hartree
nucrepener: 2879.65242168 hartree
electener: -4930.33465100 hartree
oneelecener: -8535.21865901 hartree
twoeener: 3604.88400801 hartree
cpcmener: -0.03368517 hartree
kineticenergy: 2044.46650623 hartree
xcener: -151.865540412554 hartree
chargesum: 0.0000000
charge: -0.055784 -0.063552 -0.279361 -0.444968 -0.330800 -0.090174 0.098499 0.012439 -0.083127 -0.267763 -0.257913 -0.205226 0.415263 0.047491 0.437984 -0.027337 -0.230533 -0.169942 -0.215032 0.210825 -0.111453 -0.220043 0.274498 -0.188100 -0.240392 -0.145456 -0.123890 -0.178119 0.084116 0.097510 0.095856 0.101277 0.097649 0.102084 0.100247 0.088777 0.135175 0.135942 0.167984 0.144781 0.158425 0.148705 0.152065 0.145344 0.170438 0.157230 0.148359
qa: -0.0558 -0.0636 -0.2794 -0.4450 -0.3308 -0.0902 0.0985 0.0124 -0.0831 -0.2678 -0.2579 -0.2052 0.4153 0.0475 0.4380 -0.0273 -0.2305 -0.1699 -0.2150 0.2108 -0.1115 -0.2200 0.2745 -0.1881 -0.2404 -0.1455 -0.1239 -0.1781 0.0841 0.0975 0.0959 0.1013 0.0976 0.1021 0.1002 0.0888 0.1352 0.1359 0.1680 0.1448 0.1584 0.1487 0.1521 0.1453 0.1704 0.1572 0.1484
va: 1.2692 1.2376 2.1579 2.0500 2.0786 3.1031 3.7665 3.8403 3.9036 3.9074 3.9042 3.8724 4.1367 4.1908 3.8485 3.6866 4.0643 3.8889 3.9873 3.8361 3.8951 4.0160 3.6921 3.9154 4.0194 3.8570 3.9203 3.9119 1.0406 1.0339 1.0177 0.9996 1.0005 1.0012 1.0021 1.0045 1.0130 1.0009 1.0112 1.0025 0.9894 1.0042 1.0008 1.0075 0.9737 0.9893 1.0026
dispcorr: -0.027230666 hartree
energy: -2050.709459984168
dipole: 16.29262 -16.01334 0.27927 7.79332 -6.70306 1.09026 -2.38228 5.06270 2.68042
magnitude: 2.90711 au
magnitude: 7.38930 debye
