program: Gaussian 09
title: 000074513
version: EM64L-G09RevD.01
frameworkgroup: C1[X(C12H8O4)]
method: RPBEPBE
basis: SDD
operation: Freq
keyword: #pfreq=noraman
keyword: PBEPBE/SDD
title: #p freq=noraman PBEPBE/SDD
converged: YES YES NO NO
title: Mulliken charges:
elementType: O O O O C C C C C C C C C C C C H H H H H H H H
charge: -0.283437 -0.174259 -0.198444 -0.183458 0.313401 0.255853 -0.080334 0.017956 0.354546 -0.356185 -0.358808 -0.514622 -0.225820 -0.217988 0.269193 -0.740122 0.287489 0.284977 0.289582 0.243710 0.243288 0.268946 0.254947 0.249588
chargesum: 0.00000
title: Mulliken charges with hydrogens summed into heavy atoms:
elementType: O O O O C C C C C C C C C C C C
charge: -0.283437 -0.174259 -0.198444 -0.183458 0.313401 0.255853 -0.080334 0.017956 0.354546 -0.068695 -0.069227 -0.229645 0.017890 0.025300 0.269193 0.033359
polarizability: 2.06648133e+02 9.60154818e+00 1.59873577e+02 1.00591106e+01 9.28536146e-01 7.07797857e+01
1716.lowfreq: -9.9407 -0.0008 -0.0008 0.0007 4.2124 4.2202 47.0182 55.8124 65.9437
frequency: 47.0141 55.7992 65.9390 102.6634 118.1378 137.1914 173.9744 213.7853 249.5728 281.0351 319.4067 359.7167 376.1947 426.1402 434.3497 453.4635 480.7394 507.8107 532.5943 599.7592 624.3188 668.4274 674.6427 697.9540 732.2217 764.7021 795.5123 802.8923 831.6438 911.1640 934.9387 950.2052 981.0414 996.6992 1014.8952 1030.3883 1038.5383 1069.6083 1112.1612 1132.9061 1164.0702 1174.8155 1221.7053 1263.2895 1301.1455 1321.8326 1384.3994 1398.6368 1441.0553 1450.3248 1452.0158 1470.2677 1539.1750 1557.3574 1583.6897 1608.8001 1631.1656 1709.4915 3010.3607 3101.9785 3139.9512 3145.8382 3153.1451 3163.2152 3171.8705 3173.8442
redmass: 5.4912 5.5101 3.9755 1.1478 5.6821 6.3587 7.6470 5.1477 5.7615 4.4252 9.6625 10.5323 4.9583 4.2091 6.0825 7.2189 4.1166 6.7287 3.2932 5.9818 5.5757 4.5507 4.6278 6.2044 3.6325 4.6097 1.7783 4.3966 3.1575 1.4118 1.8064 6.3196 2.4024 1.4000 1.3666 2.3328 1.6617 3.2592 1.8747 3.4505 2.7873 1.1018 1.8789 1.7976 3.6223 2.8111 1.2349 9.8009 2.4921 1.0549 1.0486 2.7030 9.7888 9.8846 7.9261 6.8456 8.7904 10.8239 1.0373 1.0957 1.0864 1.1020 1.0901 1.0949 1.0935 1.1004
irintensity: 7.0768 1.3975 3.0657 0.6087 0.9895 1.1881 2.3218 2.2744 0.2985 2.8696 2.2380 16.5068 1.7289 2.0446 7.6135 0.8095 0.2659 11.1743 12.0417 14.9630 13.1793 4.1116 0.9431 26.7865 49.4740 45.3242 55.6528 47.9772 3.0515 17.5743 9.8927 119.0039 196.1454 2.7378 0.0677 4.7340 12.1508 40.0557 76.1229 576.4395 18.0457 0.9529 15.0866 62.6516 147.4650 28.5174 73.5164 0.0580 0.2903 20.5948 23.0620 0.5209 55.4579 239.3111 54.5959 5.0586 102.3678 171.2423 0.1085 5.2547 3.2704 9.0325 3.1123 1.5025 3.9973 21.4940
temp: 298.150 k
press: 1.00000 atm
elementType: 8 8 8 8 6 6 6 6 6 6 6 6 6 6 6 6 1 1 1 1 1 1 1 1
symmnumber: 1
zpe: 445211.7 jmol-1
zpe.correction: 0.169572 hartree
zpe.thermalcorrener: 0.183228 hartree
zpe.thermalcorrenthalpy: 0.184172 hartree
zpe.thermalcorrgfe: 0.128345 hartree
zpe.sumelectzpe: -761.855238 hartree
zpe.sumelectthermal: -761.841582 hartree
zpe.sumelectthermalent: -761.840638 hartree
zpe.sumelectthermalfe: -761.896465 hartree
dipole: 0.5039 -1.4918 -1.2486
dipole: 2.0096
quadrupole: -67.0459 -96.6833 -96.9817
quadrupole: -12.0067 5.3678 0.4098
quadrupole: 19.8577 -9.7796 -10.0781 -12.0067 5.3678 0.4098
hfenergy: -762.0248101 hartree
pointgroup: C01 [X(C12H8O4)]
dipole: 0.2338951 -0.6187025 -0.4331174 debye
dipolederiv: -2.074966 -0.6061362 0.3407878 -0.6660183 -0.5671153 0.2896765 0.2972071 0.1510316 -0.579585 -0.788669 -0.1050997 -0.0494622 -0.340506 -0.6930622 -0.0764797 -0.0253317 -0.0283626 -0.2897173 -0.6400281 -0.1975481 0.0158596 -0.0594292 -0.9355214 0.055255 -0.0392187 0.0179487 -0.317418 -0.559855 -0.0357522 -0.2190683 -0.2290983 -0.3546856 0.0937598 0.4280108 0.2321994 -0.9180084 -0.7069837 0.003911 -0.0642352 -0.0054701 0.0320069 -0.0182604 -0.0724155 0.0041279 0.0053762 -0.1949063 0.2285451 -0.0172827 0.3990525 -0.3503783 0.0505077 -0.0370226 0.0490261 0.0089964 1.1836776 -0.181548 0.1508561 0.1383663 0.8976234 0.0747635 0.0560903 -0.0456537 0.1913889 1.4229218 0.0957498 0.0292965 -0.2520548 1.0189614 -0.0793983 0.1511593 -0.0508429 0.1773914 1.4087892 0.4857606 -0.1338205 0.4628601 -0.1061912 0.0129344 0.2058795 0.1343959 0.0525123 -0.0781494 0.2283974 -0.0041811 -0.0351232 0.028446 -0.0081478 -0.0117688 0.0143011 -0.0925402 -0.148021 0.0180441 -0.0110059 0.2313878 0.0548975 0.0132488 -0.0170298 -0.0054628 -0.1000534 -0.894575 -0.2198196 0.0488642 -0.3976686 -0.0219849 -0.0055718 0.0046462 0.0200844 -0.1132605 0.0401552 -0.2136609 0.0323664 -0.0974675 0.0617043 -0.0252831 0.0261705 -0.0361258 -0.1338662 0.2223765 0.0208712 0.0370092 -0.0834316 -0.0343423 -0.0182784 0.044305 -0.0053567 -0.1269569 1.8268771 0.5389394 -0.0118254 1.0035517 0.6888013 -0.3798247 -0.8546771 -0.4658004 1.4002154 -0.3404352 -0.1093501 -0.1149376 -0.1985721 -0.0519104 -0.0613423 -0.2170165 -0.0727978 -0.1189546 0.0905997 -0.0801854 -0.0022312 -0.0175473 0.0297076 0.0056682 -0.0019747 -0.00324 0.1522364 0.0353229 0.0342894 -0.0158285 0.0780323 0.0495777 0.0056435 -0.0144371 0.0029731 0.1625073 0.1092925 -0.0057438 -0.0069846 -0.0793994 0.0201333 0.0008825 -0.0016182 0.0074915 0.1541687 0.022021 0.0845983 -0.0174144 0.1006522 -0.0318769 0.0206877 -0.0194535 0.0217372 0.1547498 -0.1053994 -0.0023991 -0.0261714 -0.0088533 0.0946638 0.002327 -0.0269836 0.0035117 0.153851 0.0929266 0.0491945 0.0237787 0.0258773 0.0413745 -0.0807635 0.0425142 -0.0679892 0.0800612 0.0886447 0.0102057 -0.033713 0.0693644 0.0117686 0.0895034 -0.016956 0.0806948 0.091568 -0.0116168 -0.0412636 0.0493435 -0.0385049 0.1174023 0.0384921 0.0999209 0.0421084 0.0053374 unknown
polarizability: 205.256799|13.6434139|160.8363216|7.034379|-7.7687093|71.2083748 unknown
InChI: InChI=1S/C12H8O4/c1-7(13)16-11-6-10(14)8-4-2-3-5-9(8)12(11)15/h2-6H,1H3
charge 0 multiplicity 1
24 atoms
O  -2.60787 0.466504 -0.471987
O  -1.038462 -1.818994 -0.304246
O  1.385531 3.106415 -0.216686
O  -2.962747 -0.482089 1.650218
C  1.030762 -0.576785 -0.037155
C  1.659784 0.702694 -0.040391
C  -0.44528 -0.70318 -0.200908
C  0.847568 1.952736 -0.196671
C  -1.223951 0.583424 -0.282139
C  1.813971 -1.747743 0.108566
C  3.06374 0.794704 0.101186
C  -0.620633 1.809573 -0.306026
C  3.21317 -1.647444 0.254002
C  3.838494 -0.375527 0.249892
C  -3.380156 -0.283472 0.503076
C  -4.695481 -0.676595 -0.10976
H  1.307765 -2.718272 0.105723
H  -1.208907 2.727716 -0.398902
H  3.522161 1.788709 0.092546
H  3.817201 -2.553344 0.369556
H  4.92527 -0.300883 0.361802
H  -4.527956 -1.531342 -0.789684
H  -5.107998 0.15024 -0.71022
H  -5.403277 -0.973745 0.67731
