program: Orca
programVersion: 5.0.2
elementType: Cl Cl O O O N C C C C C C C C C C C C C C C C C C C C C C H H H H H H H H H H H H H H H H H H H
charge: 0
multiplicity: 1
keywords: wb97x-d3
keywords: def2-TZVPP
keywords: def2/J RIJCOSX
keywords: DEFGRID2
keywords: scfconv7
keywords: smallprint printgap noloewdin
keywords: NOSOSCF
formula: C22H19Cl2NO3
InChI: InChI=1/C22H19Cl2NO3/c1-22(2)17(12-19(23)24)20(22)21(26)28-18(13-25)14-7-6-10-16(11-14)27-15-8-4-3-5-9-15/h3-12,17-18,20H,1-2H3
47 atoms
Cl -1.228091 2.842008 -2.928014
Cl -3.875764 4.00154 -2.938354
O  0.990596 0.971027 0.209101
O  1.841364 2.992222 -0.210498
O  0.144094 -3.978924 0.287007
N  2.693535 0.446043 -2.657219
C  -0.833935 3.869975 1.301578
C  -0.894121 4.129753 -0.162895
C  -0.484945 2.75743 0.319751
C  0.24385 4.542645 2.1131
C  -2.122003 3.663028 2.059974
C  -2.173834 4.293998 -0.886109
C  0.894194 2.30735 0.080685
C  -2.39724 3.782035 -2.087769
C  2.250304 0.385956 -0.076541
C  2.254789 -1.043737 0.403862
C  2.493797 0.435004 -1.525922
C  1.172039 -1.879174 0.156672
C  3.370577 -1.516696 1.07944
C  1.217765 -3.196226 0.590088
C  3.406949 -2.840041 1.494285
C  2.339024 -3.687371 1.251962
C  -0.218634 -4.998893 1.128436
C  -0.501559 -6.230283 0.55757
C  -0.355455 -4.800264 2.497016
C  -0.923805 -7.275367 1.368188
C  -0.766273 -5.856857 3.29628
C  -1.050109 -7.096873 2.73837
H  -0.077001 4.727329 -0.560905
H  -1.229472 1.972663 0.246004
H  -0.131376 5.491188 2.502802
H  1.141359 4.762593 1.537763
H  0.531244 3.927346 2.96785
H  -1.944769 3.0708 2.959311
H  -2.878442 3.144322 1.469464
H  -2.542064 4.621481 2.372399
H  -2.959361 4.886398 -0.430782
H  3.062311 0.935348 0.409081
H  0.294789 -1.523211 -0.370385
H  4.207557 -0.859538 1.277703
H  4.278156 -3.218495 2.012291
H  2.387261 -4.719396 1.574766
H  -0.395518 -6.368115 -0.511156
H  -0.146863 -3.834005 2.939789
H  -1.14608 -8.236498 0.922767
H  -0.869907 -5.704589 4.362941
H  -1.371754 -7.916411 3.36751
elementType: Cl O N C H
totalener: -2050.68497289 hartree
nucrepener: 2697.70056412 hartree
electener: -4748.38553701 hartree
oneelecener: -8171.35466161 hartree
twoeener: 3422.96912460 hartree
cpcmener: -0.03228875 hartree
kineticenergy: 2044.46728388 hartree
xcener: -151.861110574719 hartree
chargesum: 0.0000000
charge: -0.049529 -0.055109 -0.281067 -0.439127 -0.324760 -0.089246 0.132566 -0.036067 -0.131035 -0.266310 -0.279944 -0.216932 0.393981 0.075364 0.419434 -0.000122 -0.233327 -0.219268 -0.180661 0.227271 -0.144854 -0.165987 0.260678 -0.232617 -0.181326 -0.128483 -0.146989 -0.175855 0.113660 0.115658 0.097202 0.093333 0.101135 0.099767 0.094654 0.102224 0.140535 0.128240 0.136743 0.146631 0.160244 0.158082 0.146683 0.158573 0.158136 0.159142 0.158677
qa: -0.0495 -0.0551 -0.2811 -0.4391 -0.3248 -0.0892 0.1326 -0.0361 -0.1310 -0.2663 -0.2799 -0.2169 0.3940 0.0754 0.4194 -0.0001 -0.2333 -0.2193 -0.1807 0.2273 -0.1449 -0.1660 0.2607 -0.2326 -0.1813 -0.1285 -0.1470 -0.1759 0.1137 0.1157 0.0972 0.0933 0.1011 0.0998 0.0947 0.1022 0.1405 0.1282 0.1367 0.1466 0.1602 0.1581 0.1467 0.1586 0.1581 0.1591 0.1587
va: 1.2837 1.2512 2.1529 2.0680 2.0768 3.1111 3.7207 3.8766 3.8385 3.8931 3.9156 3.9027 4.1638 4.1876 3.7144 3.7609 4.0194 4.0695 3.9541 3.8155 3.9224 3.8956 3.7048 4.0044 3.9132 3.8873 3.8923 3.8986 1.0242 1.0183 1.0014 1.0158 0.9994 1.0030 0.9987 0.9996 1.0082 1.0260 1.0285 1.0020 0.9915 0.9953 1.0071 0.9952 0.9892 0.9904 0.9902
dispcorr: -0.023338718 hartree
energy: -2050.708311606588
dipole: 7.55374 -8.23840 -0.68466 -13.74167 13.15846 -0.58321 35.07217 -31.50917 3.56300
magnitude: 3.67476 au
magnitude: 9.34050 debye
