program: Gaussian 09
title: 000074508
version: EM64L-G09RevD.01
frameworkgroup: C1[X(C5H4Cl2N2)]
method: RPBEPBE
basis: SDD
operation: Freq
keyword: #p
keyword: freq=noraman
keyword: PBEPBE/SDD
title: #p freq=noraman PBEPBE/SDD
converged: NO NO NO NO
title: Mulliken charges:
elementType: Cl Cl N N C C C C C H H H H
charge: 0.009404 0.034404 0.142143 0.080601 0.467720 -0.762547 -0.287416 -0.359202 -0.328100 0.255548 0.227720 0.255527 0.264200
chargesum: 0.00000
title: Mulliken charges with hydrogens summed into heavy atoms:
elementType: Cl Cl N N C C C C C
charge: 0.009404 0.034404 0.142143 0.080601 0.467720 -0.023753 -0.287416 -0.095002 -0.328100
polarizability: 1.28353858e+02 -5.97854479e-01 8.84241292e+01 -7.02564306e-03 -3.63567473e-03 3.72052008e+01
1716.lowfreq: -7.4734 -0.0011 0.0020 0.0024 2.6505 9.5322 89.1934 134.1565 164.4448
frequency: 89.1494 134.0838 164.4370 195.4300 245.9039 311.4024 371.5294 391.9280 442.4517 451.4984 614.2008 634.6960 673.3184 759.6736 799.0134 919.4259 994.7161 1047.7339 1049.9422 1159.0141 1224.7741 1256.8580 1289.6779 1377.5523 1405.3910 1442.6688 1458.3870 1490.3361 1543.7647 2988.7432 3071.4825 3099.3430 3146.3548
redmass: 4.1944 1.0668 12.4020 16.8526 3.8778 4.3458 17.7487 11.1103 3.7066 4.6054 7.9916 7.3766 8.2202 7.4762 10.6813 1.3603 1.5711 1.5299 5.0410 8.4743 3.8451 10.9200 2.7024 2.6517 1.2153 1.9857 1.0436 1.7492 6.4618 1.0368 1.0975 1.1001 1.0931
irintensity: 1.6527 0.2195 0.0496 0.2384 1.6120 0.0823 2.1281 10.8213 2.1179 1.9414 0.0002 19.5244 45.1002 2.7464 80.5850 7.4917 8.7454 10.1863 81.6435 112.7575 4.1465 2.0167 57.5406 327.6550 16.7066 34.6716 16.5181 128.5513 92.8218 10.6344 8.4880 13.3410 11.4551
temp: 298.150 k
press: 1.00000 atm
elementType: 17 17 7 7 6 6 6 6 6 1 1 1 1
symmnumber: 1
zpe: 216792.5 jmol-1
zpe.correction: 0.082572 hartree
zpe.thermalcorrener: 0.090938 hartree
zpe.thermalcorrenthalpy: 0.091882 hartree
zpe.thermalcorrgfe: 0.048299 hartree
zpe.sumelectzpe: -1221.889061 hartree
zpe.sumelectthermal: -1221.880696 hartree
zpe.sumelectthermalent: -1221.879751 hartree
zpe.sumelectthermalfe: -1221.923334 hartree
dipole: -3.6495 2.7452 0.0010
dipole: 4.5667
quadrupole: -66.5866 -65.6798 -65.3875
quadrupole: -6.0345 0.0004 0.0013
quadrupole: -0.7020 0.2049 0.4971 -6.0345 0.0004 0.0013
hfenergy: -1221.9716331 hartree
pointgroup: C01 [X(C5H4Cl2N2)]
dipole: -1.5211558 0.9561267 0.0004078 debye
dipolederiv: -0.513958 -0.3732973 0.0000999 -0.4567806 -0.5192707 0.0001167 0.0001645 0.0000811 -0.0706304 -0.8914415 0.1615171 -0.0001893 0.2151788 -0.1252628 0.0000481 -0.0010513 0.0002375 -0.0506642 -1.3649627 -0.1783153 -0.0000529 -0.2115324 -0.4339339 -0.0002008 0.0000853 0.0003265 -0.0877448 -0.8460257 -0.0182126 -0.0000089 0.4815145 -0.5594982 0.0002697 -0.0002426 -0.0000642 -0.1461518 0.111176 -0.3030101 -0.0001192 -0.3451485 -0.601203 0.0001228 -0.0001472 0.0001612 0.0924979 -0.219927 0.0409622 0.0001667 -0.0458931 0.1277353 -0.0000383 0.0004289 -0.0002583 0.0353293 1.1166732 0.5527108 -0.0003223 0.6867839 1.0486063 -0.0002152 -0.0003376 -0.0002033 0.0128056 0.4498256 0.290682 -0.000108 -0.1229861 0.4298832 0.0001003 -0.0000244 -0.0000468 -0.0522923 1.9770923 -0.2123047 0.0005254 -0.3356754 0.6433816 -0.0001596 0.0012368 -0.0003928 0.040495 0.0276483 0.011311 0.0530286 -0.0044333 0.0781808 0.0837747 0.081053 0.0435928 -0.0097717 0.0804624 -0.0397374 0.0000493 0.0746746 -0.127654 0.0003357 -0.0001315 0.0003206 0.1179923 0.0276253 0.0111055 -0.0530502 -0.0048178 0.0777877 -0.0841044 -0.0811017 -0.0437616 -0.0091187 0.0458119 0.0565889 -0.0000189 0.0691153 -0.0387523 -0.0000496 0.0000677 0.0000074 0.1272538 unknown
polarizability: 128.174027|2.7396551|88.6039607|-0.0066968|-0.0042108|37.2052008 unknown
InChI: InChI=1S/C5H4Cl2N2/c1-3-2-8-5(7)9-4(3)6/h2H,1H3
charge 0 multiplicity 1
13 atoms
Cl -1.893675 -2.086927 0.000543
Cl 3.246902 -0.519742 0.000546
N  0.611511 -1.076387 -0.00032
N  1.222892 1.263452 -0.000377
C  -1.152821 0.614274 0.000256
C  -2.609311 1.000628 0.00071
C  -0.685384 -0.72833 0.000152
C  -0.107732 1.576832 0.000028
C  1.502296 -0.058546 -0.001071
H  -3.127902 0.595208 0.888506
H  -2.723318 2.097518 -0.000831
H  -3.129223 0.592487 -0.885039
H  -0.348336 2.645732 0.000196
