program: Orca
programVersion: 5.0.2
elementType: Cl Cl O O O N C C C C C C C C C C C C C C C C C C C C C C H H H H H H H H H H H H H H H H H H H
charge: 0
multiplicity: 1
keywords: wb97x-d3
keywords: def2-TZVPP
keywords: def2/J RIJCOSX
keywords: DEFGRID2
keywords: scfconv7
keywords: smallprint printgap noloewdin
keywords: NOSOSCF
formula: C22H19Cl2NO3
InChI: InChI=1/C22H19Cl2NO3/c1-22(2)17(12-19(23)24)20(22)21(26)28-18(13-25)14-7-6-10-16(11-14)27-15-8-4-3-5-9-15/h3-12,17-18,20H,1-2H3
47 atoms
Cl -0.034802 4.926492 1.23209
Cl -1.588628 7.09669 0.128236
O  1.303674 1.244463 -0.492995
O  -0.431349 0.760396 0.827597
O  1.209298 -4.403942 1.228063
N  4.549237 0.676151 -0.487662
C  -1.982031 2.185709 -1.547492
C  -1.914812 3.058364 -0.341494
C  -0.64159 2.442788 -0.867363
C  -2.652656 0.840068 -1.436854
C  -2.137038 2.825813 -2.904952
C  -2.101259 4.523759 -0.4273
C  0.035235 1.404906 -0.075872
C  -1.343279 5.396369 0.220515
C  2.055358 0.226829 0.150429
C  1.658383 -1.16158 -0.296927
C  3.449055 0.496487 -0.212294
C  1.552836 -2.167256 0.649969
C  1.417358 -1.427686 -1.639676
C  1.223293 -3.456237 0.250754
C  1.075986 -2.715611 -2.020671
C  0.982637 -3.738645 -1.08755
C  0.356158 -5.472971 1.170079
C  -0.98327 -5.334079 0.827875
C  0.869033 -6.706153 1.545549
C  -1.806055 -6.451082 0.856914
C  0.031164 -7.811407 1.581895
C  -1.306588 -7.691102 1.232637
H  -2.289358 2.611741 0.576728
H  0.025633 3.095722 -1.418716
H  -3.707106 0.935413 -1.705861
H  -2.612044 0.418841 -0.433845
H  -2.20076 0.122117 -2.124445
H  -1.747053 2.167332 -3.6830
H  -1.609086 3.776776 -2.984388
H  -3.190807 3.009064 -3.125286
H  -2.916946 4.908206 -1.029351
H  1.979912 0.308111 1.240241
H  1.729718 -1.957813 1.698444
H  1.497435 -0.647109 -2.38541
H  0.891054 -2.935158 -3.063924
H  0.732707 -4.740968 -1.411155
H  -1.388914 -4.368996 0.550423
H  1.914476 -6.79619 1.812796
H  -2.850273 -6.344881 0.592473
H  0.432259 -8.772143 1.877993
H  -1.956714 -8.555634 1.257153
elementType: Cl O N C H
totalener: -2050.68467343 hartree
nucrepener: 2704.54901746 hartree
electener: -4755.23369089 hartree
oneelecener: -8184.66255217 hartree
twoeener: 3429.42886127 hartree
cpcmener: -0.03097512 hartree
kineticenergy: 2044.47918282 hartree
xcener: -151.863995642102 hartree
chargesum: 0.0000000
charge: -0.049421 -0.055183 -0.278966 -0.436617 -0.324422 -0.087026 0.129788 -0.022000 -0.140216 -0.268495 -0.280435 -0.220238 0.383564 0.075905 0.402933 0.034504 -0.226300 -0.235880 -0.225595 0.272812 -0.136826 -0.180657 0.283570 -0.196466 -0.247209 -0.142219 -0.121253 -0.183102 0.111649 0.115228 0.099130 0.095413 0.097840 0.099878 0.094892 0.102218 0.140240 0.140729 0.133788 0.147310 0.159652 0.157749 0.158932 0.145867 0.159005 0.157707 0.158220
qa: -0.0494 -0.0552 -0.2790 -0.4366 -0.3244 -0.0870 0.1298 -0.0220 -0.1402 -0.2685 -0.2804 -0.2202 0.3836 0.0759 0.4029 0.0345 -0.2263 -0.2359 -0.2256 0.2728 -0.1368 -0.1807 0.2836 -0.1965 -0.2472 -0.1422 -0.1213 -0.1831 0.1116 0.1152 0.0991 0.0954 0.0978 0.0999 0.0949 0.1022 0.1402 0.1407 0.1338 0.1473 0.1597 0.1577 0.1589 0.1459 0.1590 0.1577 0.1582
va: 1.2806 1.2508 2.1193 2.0751 2.0809 3.1140 3.7264 3.8724 3.8270 3.8927 3.9137 3.9073 4.1695 4.1864 3.7232 3.6150 4.0774 4.0879 3.9630 3.7655 3.9150 3.9165 3.6869 3.9200 4.0106 3.8897 3.8846 3.9047 1.0237 1.0232 1.0018 1.0165 1.0005 1.0031 0.9989 0.9997 1.0084 1.0190 1.0188 1.0128 0.9907 0.9954 0.9964 1.0082 0.9903 0.9893 0.9904
dispcorr: -0.024158844 hartree
energy: -2050.708832273765
dipole: -13.82119 11.30790 -2.51329 -38.62108 37.65498 -0.96611 -14.71459 13.44201 -1.27258
magnitude: 2.97816 au
magnitude: 7.56989 debye
