program: Orca
programVersion: 5.0.2
elementType: Cl Cl O O O N C C C C C C C C C C C C C C C C C C C C C C H H H H H H H H H H H H H H H H H H H
charge: 0
multiplicity: 1
keywords: wb97x-d3
keywords: def2-TZVPP
keywords: def2/J RIJCOSX
keywords: DEFGRID2
keywords: scfconv7
keywords: smallprint printgap noloewdin
keywords: NOSOSCF
formula: C22H19Cl2NO3
InChI: InChI=1/C22H19Cl2NO3/c1-22(2)17(12-19(23)24)20(22)21(26)28-18(13-25)14-7-6-10-16(11-14)27-15-8-4-3-5-9-15/h3-12,17-18,20H,1-2H3
47 atoms
Cl -0.088371 4.913981 1.250359
Cl -1.677912 7.05869 0.148198
O  1.33358 1.256387 -0.481912
O  -0.401464 0.74906 0.829806
O  1.205287 -4.382998 1.23088
N  4.58316 0.710898 -0.475712
C  -1.95026 2.151817 -1.563102
C  -1.916637 3.017849 -0.350708
C  -0.624604 2.431663 -0.863092
C  -2.594049 0.791805 -1.469186
C  -2.099984 2.797771 -2.918368
C  -2.132219 4.479624 -0.429187
C  0.0616 1.400894 -0.070265
C  -1.398022 5.363201 0.230999
C  2.092265 0.242314 0.159682
C  1.702671 -1.146692 -0.291552
C  3.484081 0.522388 -0.201978
C  1.573854 -2.14989 0.654947
C  1.485188 -1.413918 -1.638136
C  1.24415 -3.437649 0.251936
C  1.143977 -2.700562 -2.02329
C  1.027123 -3.721247 -1.090137
C  0.346294 -5.446456 1.159658
C  -0.985108 -5.300064 0.790298
C  0.843336 -6.68147 1.55017
C  -1.815776 -6.411459 0.807272
C  -0.002504 -7.780954 1.574109
C  -1.332186 -7.653196 1.197734
H  -2.294324 2.557704 0.559516
H  0.036895 3.100677 -1.401961
H  -3.646405 0.866338 -1.752514
H  -2.558497 0.36617 -0.467811
H  -2.117458 0.087198 -2.154011
H  -1.591538 3.760362 -2.983756
H  -3.154235 2.9601 -3.152407
H  -1.685057 2.153307 -3.695261
H  -2.950696 4.851245 -1.03549
H  2.0160 0.320796 1.249612
H  1.731692 -1.939339 1.706208
H  1.583039 -0.634834 -2.383365
H  0.977402 -2.921053 -3.069434
H  0.777256 -4.722676 -1.416559
H  -1.378837 -4.333453 0.501286
H  1.88262 -6.777341 1.838621
H  -2.853813 -6.299378 0.521747
H  0.386151 -8.743139 1.881854
H  -1.988466 -8.513289 1.212716
elementType: Cl O N C H
totalener: -2050.68464669 hartree
nucrepener: 2706.90600201 hartree
electener: -4757.59064870 hartree
oneelecener: -8189.37711232 hartree
twoeener: 3431.78646362 hartree
cpcmener: -0.03095831 hartree
kineticenergy: 2044.48028908 hartree
xcener: -151.864166941073 hartree
chargesum: -0.0000000
charge: -0.049433 -0.055288 -0.278327 -0.436336 -0.324511 -0.086996 0.130705 -0.021675 -0.141104 -0.268855 -0.280635 -0.221174 0.382911 0.076274 0.403088 0.034839 -0.226133 -0.235464 -0.228041 0.273589 -0.136023 -0.181298 0.283996 -0.196699 -0.247461 -0.142295 -0.120858 -0.183299 0.111678 0.115731 0.099282 0.095528 0.097839 0.094902 0.102166 0.099984 0.140213 0.140526 0.134003 0.147333 0.160029 0.157695 0.158949 0.145925 0.159098 0.157461 0.158160
qa: -0.0494 -0.0553 -0.2783 -0.4363 -0.3245 -0.0870 0.1307 -0.0217 -0.1411 -0.2689 -0.2806 -0.2212 0.3829 0.0763 0.4031 0.0348 -0.2261 -0.2355 -0.2280 0.2736 -0.1360 -0.1813 0.2840 -0.1967 -0.2475 -0.1423 -0.1209 -0.1833 0.1117 0.1157 0.0993 0.0955 0.0978 0.0949 0.1022 0.1000 0.1402 0.1405 0.1340 0.1473 0.1600 0.1577 0.1589 0.1459 0.1591 0.1575 0.1582
va: 1.2806 1.2507 2.1202 2.0756 2.0810 3.1138 3.7254 3.8715 3.8258 3.8928 3.9135 3.9077 4.1724 4.1862 3.7239 3.6105 4.0779 4.0862 3.9650 3.7653 3.9140 3.9174 3.6864 3.9201 4.0106 3.8900 3.8846 3.9049 1.0237 1.0230 1.0020 1.0163 1.0004 0.9988 0.9998 1.0031 1.0084 1.0188 1.0188 1.0128 0.9906 0.9955 0.9964 1.0082 0.9903 0.9893 0.9904
dispcorr: -0.024209844 hartree
energy: -2050.708856537379
dipole: -13.23726 10.74770 -2.48956 -38.64221 37.65541 -0.98680 -15.01437 13.72103 -1.29334
magnitude: 2.97396 au
magnitude: 7.55920 debye
