program: Orca
programVersion: 5.0.2
elementType: Cl Cl O O O N C C C C C C C C C C C C C C C C C C C C C C H H H H H H H H H H H H H H H H H H H
charge: 0
multiplicity: 1
keywords: wb97x-d3
keywords: def2-TZVPP
keywords: def2/J RIJCOSX
keywords: DEFGRID2
keywords: scfconv7
keywords: smallprint printgap noloewdin
keywords: NOSOSCF
formula: C22H19Cl2NO3
InChI: InChI=1/C22H19Cl2NO3/c1-22(2)17(12-19(23)24)20(22)21(26)28-18(13-25)14-7-6-10-16(11-14)27-15-8-4-3-5-9-15/h3-12,17-18,20H,1-2H3
47 atoms
Cl -3.668158 3.818772 1.220337
Cl -3.382916 5.824401 -0.832003
O  1.838657 1.031109 -0.38498
O  0.192856 0.386688 0.988849
O  1.871589 -4.481237 0.649693
N  5.003669 1.709311 0.282414
C  -1.570561 0.997704 -1.528205
C  -1.681216 2.12917 -0.548902
C  -0.310237 1.647209 -0.985043
C  -1.993404 -0.373906 -1.061439
C  -1.853816 1.234491 -2.991906
C  -2.109707 3.472702 -0.956116
C  0.550676 0.957236 -0.009168
C  -2.934293 4.25761 -0.27375
C  2.794578 0.321932 0.402494
C  2.97078 -1.079933 -0.125534
C  4.028637 1.103988 0.319788
C  2.347337 -2.12738 0.537896
C  3.689991 -1.313588 -1.293123
C  2.436222 -3.412208 0.016425
C  3.788588 -2.603941 -1.787279
C  3.156412 -3.65708 -1.142793
C  0.583408 -4.40398 1.106636
C  0.292062 -5.087418 2.278891
C  -0.413457 -3.728338 0.413138
C  -1.009885 -5.097603 2.757163
C  -1.709606 -3.74121 0.908763
C  -2.015545 -4.423334 2.078507
H  -1.967243 1.828347 0.452585
H  0.22083 2.27548 -1.691144
H  -3.034017 -0.545169 -1.343507
H  -1.923541 -0.502376 0.016035
H  -1.39164 -1.149447 -1.53982
H  -1.41571 0.434786 -3.591767
H  -1.449829 2.175685 -3.36313
H  -2.929619 1.234749 -3.177229
H  -1.72247 3.868473 -1.887507
H  2.498213 0.298485 1.45489
H  1.799618 -1.943019 1.454179
H  4.178803 -0.499884 -1.81488
H  4.354248 -2.793548 -2.689906
H  3.224886 -4.664527 -1.533667
H  1.079095 -5.610309 2.807786
H  -0.193459 -3.202749 -0.507833
H  -1.23471 -5.632904 3.670642
H  -2.486941 -3.218226 0.366141
H  -3.029394 -4.431361 2.456281
elementType: Cl O N C H
totalener: -2050.68644882 hartree
nucrepener: 2757.37171165 hartree
electener: -4808.05816047 hartree
oneelecener: -8289.76379134 hartree
twoeener: 3481.70563087 hartree
cpcmener: -0.03061135 hartree
kineticenergy: 2044.46552860 hartree
xcener: -151.861989125543 hartree
chargesum: 0.0000000
charge: -0.055064 -0.059339 -0.275777 -0.446048 -0.329338 -0.088023 0.110491 0.034706 -0.094548 -0.303090 -0.263593 -0.205094 0.409050 0.042546 0.400701 -0.008327 -0.222335 -0.148643 -0.200385 0.239775 -0.132410 -0.212068 0.279979 -0.247563 -0.191013 -0.119817 -0.152401 -0.187594 0.081932 0.098221 0.103291 0.097231 0.104815 0.098769 0.091426 0.102281 0.129319 0.133829 0.145862 0.142417 0.159919 0.148628 0.144749 0.160770 0.157306 0.167213 0.157244
qa: -0.0551 -0.0593 -0.2758 -0.4460 -0.3293 -0.0880 0.1105 0.0347 -0.0945 -0.3031 -0.2636 -0.2051 0.4091 0.0425 0.4007 -0.0083 -0.2223 -0.1486 -0.2004 0.2398 -0.1324 -0.2121 0.2800 -0.2476 -0.1910 -0.1198 -0.1524 -0.1876 0.0819 0.0982 0.1033 0.0972 0.1048 0.0988 0.0914 0.1023 0.1293 0.1338 0.1459 0.1424 0.1599 0.1486 0.1447 0.1608 0.1573 0.1672 0.1572
va: 1.2705 1.2455 2.1316 2.0644 2.0782 3.1101 3.7191 3.8662 3.8699 3.9101 3.9054 3.8988 4.1775 4.2129 3.7354 3.6680 4.0663 3.9128 3.9894 3.7658 3.9144 4.0231 3.7151 4.0048 3.8920 3.8919 3.8860 3.9253 1.0461 1.0331 1.0017 1.0126 0.9947 1.0014 1.0060 1.0009 1.0185 1.0212 1.0168 1.0084 0.9898 1.0042 1.0087 0.9926 0.9886 0.9853 0.9913
dispcorr: -0.025086576 hartree
energy: -2050.711535398415
dipole: 4.98612 -6.12461 -1.13849 -33.51455 32.25453 -1.26002 -10.48441 9.00955 -1.47486
magnitude: 2.24922 au
magnitude: 5.71707 debye
