program: Gaussian 09
title: 000074519
version: EM64L-G09RevD.01
frameworkgroup: C1[X(C13H16ClNO)]
method: RPBEPBE
basis: SDD
operation: Freq
keyword: #p
keyword: freq=noraman
keyword: PBEPBE/SDD
title: #p freq=noraman PBEPBE/SDD
converged: YES YES NO NO
title: Mulliken charges:
elementType: Cl O N C C C C C C C C C C C C C H H H H H H H H H H H H H H H H
charge: -0.067788 -0.215575 -0.691964 -0.178020 -0.444613 -0.439597 -0.400917 -0.392434 -0.388555 0.071115 0.201312 0.292405 -0.299211 -0.403627 -0.142437 -0.202167 0.237665 0.232943 0.208575 0.178927 0.240081 0.206562 0.193163 0.189447 0.204453 0.202259 0.197531 0.293733 0.219763 0.253888 0.311001 0.332080
chargesum: 0.00000
title: Mulliken charges with hydrogens summed into heavy atoms:
elementType: Cl O N C C C C C C C C C C C C C
charge: -0.067788 -0.215575 -0.048883 0.059645 -0.003094 -0.020589 -0.001191 0.001467 0.011235 0.071115 0.201312 0.292405 -0.005478 -0.183865 -0.142437 0.051721
polarizability: 2.23788485e+02 6.39044727e+00 1.60132272e+02 -1.08790927e+01 9.47564793e+00 1.01373114e+02
1716.lowfreq: -6.6449 0.0020 0.0025 0.0026 6.2027 9.2926 22.9185 61.4552 68.6862
frequency: 22.8063 61.4118 68.6564 119.3204 135.5099 153.3225 180.3584 202.8905 237.7122 275.1677 282.8493 316.4223 352.7756 355.5176 364.3776 403.8849 417.4231 425.4203 435.8800 452.9942 498.0118 515.9700 559.9718 632.3543 648.1750 690.3887 748.8114 773.4162 787.7332 798.5353 810.4621 840.5262 865.9167 880.6977 893.3049 912.6603 925.7228 943.3650 976.2671 1016.1211 1036.1197 1048.0327 1053.2288 1072.1880 1083.7336 1112.2203 1133.2156 1150.8317 1172.5422 1192.9508 1245.1970 1257.3400 1259.2499 1263.7510 1299.0656 1308.3086 1314.0955 1332.4717 1335.3914 1344.6248 1350.0524 1352.7481 1391.7452 1404.0378 1462.7159 1466.6752 1466.9060 1471.6333 1477.9147 1482.8258 1557.6666 1569.1135 1612.5792 1647.1480 2941.5959 2964.4551 2966.3686 2972.5696 2988.8089 2995.1270 3020.0922 3029.2660 3032.1499 3040.7543 3057.0728 3125.9597 3167.6842 3169.9796 3556.8773 3694.9254
redmass: 6.3732 3.3955 3.9894 4.5391 6.9579 5.1917 4.8264 3.9132 1.9156 4.3431 3.1294 4.6529 7.4962 2.4281 3.7628 1.2473 1.4632 2.7286 2.4022 2.6274 1.9325 2.3620 3.7627 7.3441 6.9300 5.0404 3.9235 2.3913 1.5558 3.7426 1.6034 3.3656 3.0008 1.6895 1.6456 1.4249 1.8185 1.3525 3.0966 1.8000 2.3769 1.8644 1.8738 1.1226 1.9711 2.2826 2.2486 1.4054 1.3938 2.1607 1.4429 1.4971 1.2779 1.3659 1.7937 1.4102 1.4117 1.3426 1.3728 1.4837 1.4257 1.4366 8.5606 4.2175 1.0883 1.0887 1.0924 1.0893 2.7482 1.1234 8.1447 7.3769 5.9905 1.1888 1.0659 1.0639 1.0627 1.0631 1.0614 1.0834 1.0953 1.0951 1.0983 1.1028 1.1021 1.0894 1.0923 1.0954 1.0453 1.1038
irintensity: 0.5207 0.9253 0.1947 0.3129 2.7648 1.5600 1.6205 2.2996 1.9521 1.5059 3.4356 0.2408 6.7261 0.2629 2.4743 77.3746 129.9418 6.7929 32.5890 19.9202 2.0887 8.4901 5.7916 35.1398 19.7054 15.3891 4.5366 0.2758 0.3939 1.7539 50.9914 0.5135 19.8679 1.8525 6.0354 15.8064 0.4819 1.3481 32.6455 10.8614 7.0914 0.4767 4.0986 0.1684 6.4050 0.1522 2.3836 30.6689 2.4741 139.4794 29.3013 18.3434 2.0438 3.3893 40.8043 16.2808 18.4541 1.9199 0.6897 0.5113 8.5879 10.3049 13.1185 109.0980 4.1734 7.9579 18.5180 11.8793 165.4922 19.7871 162.6537 12.5199 22.4007 130.5849 56.7371 48.1396 31.7491 33.8658 20.9649 4.4816 39.7489 58.5028 36.1819 51.4833 62.6535 15.3574 0.9365 9.0387 76.9762 57.0420
temp: 298.150 k
press: 1.00000 atm
elementType: 17 8 7 6 6 6 6 6 6 6 6 6 6 6 6 6 1 1 1 1 1 1 1 1 1 1 1 1 1 1 1 1
symmnumber: 1
zpe: 690455.3 jmol-1
zpe.correction: 0.262981 hartree
zpe.thermalcorrener: 0.278086 hartree
zpe.thermalcorrenthalpy: 0.279030 hartree
zpe.thermalcorrgfe: 0.220193 hartree
zpe.sumelectzpe: -1093.835849 hartree
zpe.sumelectthermal: -1093.820744 hartree
zpe.sumelectthermalent: -1093.819800 hartree
zpe.sumelectthermalfe: -1093.878637 hartree
dipole: 3.0894 5.1424 1.6670
dipole: 6.2263
quadrupole: -103.7891 -93.3972 -107.5438
quadrupole: -4.6954 -1.5695 -2.4954
quadrupole: -2.2124 8.1795 -5.9671 -4.6954 -1.5695 -2.4954
hfenergy: -1094.09883 hartree
pointgroup: C01 [X(C13H16Cl1N1O1)]
dipole: -0.9142827 -1.4641756 1.7380967 debye
polarizability: 222.4757651|12.7189636|137.6888716|-4.3014751|-31.8318502|125.1292344 unknown
InChI: InChI=1S/C13H16ClNO/c14-10-6-7-12(15)11(8-10)13(16)9-4-2-1-3-5-9/h6-9H,1-5,15H2
charge 0 multiplicity 1
32 atoms
Cl 4.777899 1.629708 -1.254383
O  -0.464488 0.762319 -2.034466
N  0.507756 -1.980609 1.062515
C  -1.499355 0.15631 0.067978
C  -2.197412 1.546849 0.171279
C  -2.514275 -0.900363 -0.467143
C  -3.462776 1.476465 1.055847
C  -3.784638 -0.97007 0.411837
C  -4.460308 0.416043 0.53354
C  -0.287914 0.276242 -0.874244
C  1.098555 -0.054938 -0.402547
C  1.436406 -1.0746 0.554431
C  2.142653 0.735073 -0.966784
C  2.79882 -1.197911 0.97002
C  3.463897 0.577554 -0.544456
C  3.805998 -0.377628 0.439271
H  -1.166025 -0.128774 1.085122
H  -2.460725 1.87907 -0.850672
H  -1.485169 2.289448 0.580462
H  -2.048858 -1.907443 -0.539436
H  -2.781522 -0.614722 -1.50325
H  -3.946374 2.471886 1.089126
H  -3.174316 1.227233 2.098373
H  -3.516359 -1.33456 1.425758
H  -4.492987 -1.70623 -0.01548
H  -5.340579 0.353604 1.201916
H  -4.833014 0.727278 -0.463814
H  1.868369 1.47314 -1.726256
H  3.065678 -1.963299 1.70875
H  4.842498 -0.485377 0.77262
H  0.812978 -2.701157 1.711505
H  -0.434415 -2.047641 0.690383
