program: Orca
programVersion: 5.0.2
elementType: Cl Cl O O O N C C C C C C C C C C C C C C C C C C C C C C H H H H H H H H H H H H H H H H H H H
charge: 0
multiplicity: 1
keywords: wb97x-d3
keywords: def2-TZVPP
keywords: def2/J RIJCOSX
keywords: DEFGRID2
keywords: scfconv7
keywords: smallprint printgap noloewdin
keywords: NOSOSCF
formula: C22H19Cl2NO3
InChI: InChI=1/C22H19Cl2NO3/c1-22(2)17(12-19(23)24)20(22)21(26)28-18(13-25)14-7-6-10-16(11-14)27-15-8-4-3-5-9-15/h3-12,17-18,20H,1-2H3
47 atoms
Cl -1.281358 3.510698 -2.647186
Cl -3.656757 5.083122 -2.17171
O  0.443043 0.411691 -0.673141
O  1.702499 2.109992 0.053403
O  1.313471 -3.898145 2.221506
N  0.89937 -1.828162 -3.062259
C  -0.881404 2.892167 1.645436
C  -0.80695 3.688088 0.389559
C  -0.677641 2.181725 0.313123
C  0.243666 2.990975 2.644802
C  -2.230541 2.671046 2.285278
C  -1.999032 4.336329 -0.199859
C  0.615875 1.610286 -0.089535
C  -2.276663 4.311145 -1.495411
C  1.618024 -0.278125 -1.086264
C  2.204994 -1.095333 0.037963
C  1.197484 -1.1370 -2.195059
C  1.454168 -2.12669 0.591675
C  3.470498 -0.8008 0.523233
C  1.996221 -2.884745 1.618464
C  3.990114 -1.554128 1.567215
C  3.264668 -2.600021 2.11157
C  0.458725 -4.689055 1.499003
C  0.784668 -5.171425 0.236747
C  -0.735192 -5.047037 2.108197
C  -0.107733 -6.007925 -0.417944
C  -1.611594 -5.895772 1.446581
C  -1.306941 -6.373223 0.179609
H  0.123757 4.228481 0.233105
H  -1.543094 1.641909 -0.053308
H  0.394517 2.03923 3.157631
H  -0.007974 3.735206 3.402696
H  1.190034 3.288612 2.199709
H  -3.031276 2.552708 1.554451
H  -2.489155 3.513658 2.929808
H  -2.216632 1.773818 2.906207
H  -2.672471 4.878699 0.4543
H  2.366289 0.416016 -1.481253
H  0.458763 -2.339503 0.218032
H  4.047699 0.006466 0.091401
H  4.975667 -1.331611 1.954227
H  3.675224 -3.196441 2.916604
H  1.721244 -4.904703 -0.237069
H  -0.971905 -4.668568 3.09478
H  0.143408 -6.37992 -1.402987
H  -2.541029 -6.176641 1.925045
H  -1.995821 -7.028066 -0.337464
elementType: Cl O N C H
totalener: -2050.68435370 hartree
nucrepener: 2751.65963632 hartree
electener: -4802.34399002 hartree
oneelecener: -8279.19646586 hartree
twoeener: 3476.85247584 hartree
cpcmener: -0.02922823 hartree
kineticenergy: 2044.47834564 hartree
xcener: -151.863485144114 hartree
chargesum: -0.0000000
charge: -0.049500 -0.054492 -0.283676 -0.447555 -0.327568 -0.088612 0.130343 -0.025463 -0.143883 -0.273349 -0.279856 -0.221715 0.402313 0.078782 0.426389 0.018778 -0.233211 -0.206272 -0.194035 0.247730 -0.115669 -0.231647 0.287353 -0.195929 -0.249427 -0.139696 -0.120296 -0.185801 0.113516 0.115606 0.102257 0.095657 0.095923 0.094107 0.102038 0.100201 0.139940 0.136766 0.147127 0.146016 0.159342 0.149241 0.155644 0.146591 0.159690 0.157872 0.158434
qa: -0.0495 -0.0545 -0.2837 -0.4476 -0.3276 -0.0886 0.1303 -0.0255 -0.1439 -0.2733 -0.2799 -0.2217 0.4023 0.0788 0.4264 0.0188 -0.2332 -0.2063 -0.1940 0.2477 -0.1157 -0.2316 0.2874 -0.1959 -0.2494 -0.1397 -0.1203 -0.1858 0.1135 0.1156 0.1023 0.0957 0.0959 0.0941 0.1020 0.1002 0.1399 0.1368 0.1471 0.1460 0.1593 0.1492 0.1556 0.1466 0.1597 0.1579 0.1584
va: 1.2819 1.2517 2.1252 2.0633 2.0853 3.1096 3.7169 3.8692 3.8524 3.8919 3.9174 3.9096 4.1439 4.1830 3.7247 3.6055 4.0791 3.9640 3.9578 3.7716 3.9056 4.0111 3.6898 3.9107 4.0131 3.8901 3.8835 3.9087 1.0221 1.0229 0.9984 1.0016 1.0180 0.9991 0.9998 1.0026 1.0088 1.0191 1.0126 1.0078 0.9894 1.0048 0.9973 1.0078 0.9900 0.9891 0.9904
dispcorr: -0.024293821 hartree
energy: -2050.708647523071
dipole: 8.26225 -8.39585 -0.13360 -18.91652 19.50530 0.58878 28.53432 -26.47619 2.05813
magnitude: 2.14486 au
magnitude: 5.45179 debye
