program: Gaussian 09
title: 000074553
version: EM64L-G09RevD.01
frameworkgroup: C1[X(C15H16O2S)]
method: RPBEPBE
basis: SDD
operation: Freq
keyword: #p
keyword: freq=noraman
keyword: PBEPBE/SDD
title: #p freq=noraman PBEPBE/SDD
converged: YES YES NO NO
title: Mulliken charges:
elementType: S O O C C C C C C C C C C C C C C C H H H H H H H H H H H H H H H H
charge: 0.838531 -0.544087 -0.541070 -0.204290 -0.046690 0.475475 -0.417022 0.461907 -0.382501 -0.224815 -0.268601 -0.397390 -0.834657 0.450659 -0.365186 -0.385845 -0.799618 -0.800635 0.305255 0.238006 0.272046 0.292026 0.235585 0.282512 0.225967 0.247766 0.241970 0.243523 0.232049 0.223679 0.243138 0.229053 0.229039 0.244223
chargesum: 0.00000
title: Mulliken charges with hydrogens summed into heavy atoms:
elementType: S O O C C C C C C C C C C C C C C C
charge: 0.838531 -0.544087 -0.541070 -0.204290 -0.046690 0.475475 -0.111767 0.461907 -0.144495 0.047231 0.023425 -0.161804 -0.078413 0.450659 -0.123216 -0.142322 -0.100752 -0.098319
polarizability: 2.47670271e+02 -1.63861884e+01 1.81764388e+02 4.01365345e+00 -9.87715777e+00 1.47694911e+02
1716.lowfreq: -6.3539 0.0010 0.0012 0.0018 0.6715 9.2142 27.8653 33.9596 38.8461
frequency: 27.7863 33.8824 38.7800 42.4615 48.3404 107.0959 120.5233 133.0326 145.8544 160.2309 175.1596 221.4353 224.8962 247.7418 285.5062 309.1110 314.2701 316.5384 373.6979 388.1421 405.3524 436.6927 447.6858 456.5318 470.0764 515.0178 557.2239 590.3348 623.2578 663.4033 709.6267 712.6111 732.0381 772.6188 788.6074 826.7089 829.4771 845.3432 852.5758 912.5337 925.6973 959.1992 969.8470 978.4414 982.5296 990.4198 995.5372 1013.8127 1018.1437 1049.6858 1050.2812 1053.7095 1055.2221 1116.9449 1153.9031 1182.4174 1215.1570 1217.9023 1224.8488 1277.8419 1294.4266 1351.0089 1380.7544 1389.9485 1398.6371 1398.8808 1401.4728 1405.2486 1465.1172 1468.2813 1471.5380 1473.4134 1474.6405 1475.0935 1484.9778 1491.1931 1561.1434 1595.9992 1596.4872 1623.1126 2980.0654 2980.4193 2980.9229 3062.3572 3063.0197 3064.1909 3090.6581 3091.5450 3098.3708 3121.8784 3130.7049 3131.9185 3134.3572 3145.7139 3156.5267 3160.8767
redmass: 3.8263 4.2529 1.0401 1.1032 3.0579 4.3882 1.9459 5.6936 1.6666 3.0082 4.4130 7.9715 6.6627 5.7219 4.6634 3.7225 3.5277 3.5482 3.6795 6.1075 2.8799 5.0714 3.3845 3.9228 4.4829 3.4028 3.8468 5.9561 6.9604 7.3894 3.2231 3.2380 4.3755 6.6716 7.2506 1.3690 1.2909 5.5383 1.2631 10.1715 1.3410 1.3307 1.3587 1.5267 1.3740 1.4112 5.0009 1.4805 2.4930 1.5914 1.5681 2.2877 1.6036 1.2806 1.3131 1.1481 1.6620 2.9451 6.8628 1.4037 1.2683 3.7022 5.8698 3.0842 1.2203 1.3049 3.2106 1.2197 1.0927 1.0839 1.0976 1.0721 1.1011 2.0431 1.1041 3.0348 4.7877 6.7128 6.2632 7.1995 1.0385 1.0387 1.0387 1.0953 1.0950 1.0947 1.0999 1.1000 1.1001 1.0875 1.0911 1.0889 1.0889 1.0967 1.0952 1.0966
irintensity: 0.1857 0.8351 0.7331 0.7627 0.4000 1.0358 1.6142 2.3417 0.2363 0.5650 3.1012 5.1257 8.9759 1.2120 5.2101 1.9545 2.2771 0.4899 2.0487 15.2805 0.0409 31.1072 2.2154 8.1739 62.3122 97.8472 1.4826 38.2687 0.2868 3.0978 3.0877 3.3977 2.4169 30.0085 59.9788 27.3225 27.5687 2.5979 4.2944 73.0886 3.1178 0.6817 0.3746 2.1849 0.7379 0.8557 2.2284 2.5864 1.0778 24.6890 11.2897 36.7585 8.7792 8.6976 14.0839 10.6733 11.2781 4.9254 1.4005 7.3189 3.1571 1.8928 0.1140 8.7485 16.0515 13.2192 0.0782 13.5844 13.0291 8.3685 15.0249 20.3756 10.9132 22.5637 44.7767 45.2076 3.7636 2.1283 6.2592 7.3945 33.8957 22.5169 18.9062 17.2845 18.5250 19.8096 17.0817 15.0589 10.5320 9.9524 7.2140 12.9665 9.3881 29.7467 4.4210 8.1439
temp: 298.150 k
press: 1.00000 atm
elementType: 16 8 8 6 6 6 6 6 6 6 6 6 6 6 6 6 6 6 1 1 1 1 1 1 1 1 1 1 1 1 1 1 1 1
symmnumber: 1
zpe: 699149.4 jmol-1
zpe.correction: 0.266292 hartree
zpe.thermalcorrener: 0.284959 hartree
zpe.thermalcorrenthalpy: 0.285903 hartree
zpe.thermalcorrgfe: 0.217601 hartree
zpe.sumelectzpe: -1128.248090 hartree
zpe.sumelectthermal: -1128.229423 hartree
zpe.sumelectthermalent: -1128.228479 hartree
zpe.sumelectthermalfe: -1128.296781 hartree
dipole: -1.0850 -1.7600 -6.3804
dipole: 6.7071
quadrupole: -87.2296 -109.5380 -127.7987
quadrupole: -2.2502 -0.1797 -5.1802
quadrupole: 20.9592 -1.3492 -19.6099 -2.2502 -0.1797 -5.1802
hfenergy: -1128.5143823 hartree
pointgroup: C01 [X(C15H16O2S1)]
dipole: 0.4057295 1.0939657 -2.3667976 debye
polarizability: 243.6961318|-20.4294981|180.3208958|-10.1395169|16.8784333|153.1125413 unknown
InChI: InChI=1S/C15H16O2S/c1-11-5-8-14(9-6-11)18(16,17)15-10-12(2)4-7-13(15)3/h4-10H,1-3H3
charge 0 multiplicity 1
34 atoms
S  -0.112853 -0.657403 1.44245
O  -0.090046 -2.282388 1.65664
O  -0.231523 0.360254 2.722598
C  -1.550692 -0.170546 0.266376
C  1.487371 -0.209285 0.530165
C  -1.818075 -0.897912 -0.916853
C  -2.312601 0.912866 0.727351
C  -3.43081 1.350215 -0.026538
C  -2.94049 -0.437839 -1.655876
C  1.880152 1.137497 0.480925
C  2.26118 -1.256461 0.008951
C  -3.723061 0.656884 -1.227774
C  -0.993734 -2.073591 -1.405678
C  3.916094 0.423129 -0.71761
C  3.100958 1.44466 -0.159344
C  3.481699 -0.925314 -0.620986
C  -4.295542 2.498473 0.46067
C  5.244383 0.764286 -1.368483
H  -2.034416 1.390235 1.674903
H  -3.199361 -0.956525 -2.586377
H  1.264884 1.916792 0.942343
H  1.92533 -2.292924 0.121476
H  -4.580383 0.972635 -1.83442
H  -0.801226 -2.791431 -0.589733
H  -1.512229 -2.594182 -2.227901
H  -0.010569 -1.739314 -1.789162
H  3.428811 2.489046 -0.217876
H  4.106234 -1.724724 -1.036288
H  -3.692567 3.275804 0.961663
H  -4.844591 2.971997 -0.371594
H  -5.045439 2.144511 1.194117
H  5.519974 0.025823 -2.14106
H  5.221815 1.762488 -1.83922
H  6.057923 0.773742 -0.617458
