program: Orca
programVersion: 5.0.2
elementType: Cl Cl O O O N C C C C C C C C C C C C C C C C C C C C C C H H H H H H H H H H H H H H H H H H H
charge: 0
multiplicity: 1
keywords: wb97x-d3
keywords: def2-TZVPP
keywords: def2/J RIJCOSX
keywords: DEFGRID2
keywords: scfconv7
keywords: smallprint printgap noloewdin
keywords: NOSOSCF
formula: C22H19Cl2NO3
InChI: InChI=1/C22H19Cl2NO3/c1-22(2)17(12-19(23)24)20(22)21(26)28-18(13-25)14-7-6-10-16(11-14)27-15-8-4-3-5-9-15/h3-12,17-18,20H,1-2H3
47 atoms
Cl -2.409334 -0.285589 0.046165
Cl -4.099403 1.06317 1.958182
O  2.34163 1.962102 0.678339
O  1.650138 1.736034 -1.430213
O  0.338211 -2.563452 1.197423
N  5.032019 2.051303 -1.407981
C  -0.519391 3.865786 -0.696579
C  -1.077874 2.523527 -0.3529
C  0.303958 2.931348 0.163534
C  -0.152473 4.131891 -2.136003
C  -1.033014 5.095834 0.01456
C  -2.17022 2.338956 0.61234
C  1.463197 2.170585 -0.323942
C  -2.803354 1.193159 0.830673
C  3.426879 1.093511 0.421851
C  3.00492 -0.340367 0.158639
C  4.29403 1.628724 -0.63599
C  1.837251 -0.81695 0.743126
C  3.797227 -1.193258 -0.597082
C  1.469633 -2.140089 0.560319
C  3.420531 -2.519435 -0.760252
C  2.258548 -3.005662 -0.186226
C  -0.631194 -3.239413 0.512836
C  -1.4548 -4.064541 1.267999
C  -0.844505 -3.085626 -0.852028
C  -2.500161 -4.73545 0.652369
C  -1.889637 -3.772877 -1.454856
C  -2.721053 -4.598582 -0.711648
H  -1.043203 1.798447 -1.159157
H  0.352927 3.195373 1.213391
H  0.086464 3.230517 -2.694459
H  0.700273 4.809617 -2.20341
H  -0.994703 4.612415 -2.63714
H  -1.978661 5.424639 -0.420238
H  -0.31757 5.912838 -0.091146
H  -1.188325 4.944073 1.082566
H  -2.493997 3.193358 1.194497
H  4.018157 1.123235 1.341837
H  1.20166 -0.180661 1.346665
H  4.709373 -0.842463 -1.062792
H  4.04429 -3.182731 -1.34469
H  1.974855 -4.042307 -0.317212
H  -1.280098 -4.171257 2.331472
H  -0.217526 -2.434572 -1.447816
H  -3.141301 -5.37475 1.245623
H  -2.054276 -3.651336 -2.517829
H  -3.534336 -5.128273 -1.189714
elementType: Cl O N C H
totalener: -2050.68347151 hartree
nucrepener: 2897.76362268 hartree
electener: -4948.44709419 hartree
oneelecener: -8571.74024360 hartree
twoeener: 3623.29314941 hartree
cpcmener: -0.03293468 hartree
kineticenergy: 2044.46781300 hartree
xcener: -151.868170590799 hartree
chargesum: 0.0000000
charge: -0.050716 -0.058601 -0.292387 -0.432777 -0.317491 -0.083292 0.121955 -0.042017 -0.034198 -0.269809 -0.286200 -0.169449 0.360742 0.041881 0.504195 -0.034561 -0.250271 -0.256327 -0.193799 0.251751 -0.118593 -0.181890 0.309350 -0.256619 -0.252626 -0.114664 -0.122303 -0.194263 0.097232 0.099478 0.096241 0.100924 0.096761 0.107184 0.100588 0.090867 0.129397 0.147345 0.130956 0.135535 0.159588 0.159276 0.144679 0.154495 0.156095 0.159366 0.156970
qa: -0.0507 -0.0586 -0.2924 -0.4328 -0.3175 -0.0833 0.1220 -0.0420 -0.0342 -0.2698 -0.2862 -0.1694 0.3607 0.0419 0.5042 -0.0346 -0.2503 -0.2563 -0.1938 0.2518 -0.1186 -0.1819 0.3093 -0.2566 -0.2526 -0.1147 -0.1223 -0.1943 0.0972 0.0995 0.0962 0.1009 0.0968 0.1072 0.1006 0.0909 0.1294 0.1473 0.1310 0.1355 0.1596 0.1593 0.1447 0.1545 0.1561 0.1594 0.1570
va: 1.2910 1.2482 2.1280 2.0717 2.0642 3.1041 3.7983 3.9104 3.7993 3.8910 3.9146 3.8705 4.1666 4.2195 3.7860 3.7895 4.1065 4.0767 3.9627 3.7645 3.9101 3.9509 3.5967 4.0158 3.8401 3.8878 3.8705 3.9159 1.0359 1.0336 1.0193 0.9998 1.0001 0.9985 1.0016 1.0031 1.0198 0.9874 1.0312 1.0156 0.9910 0.9949 1.0092 1.0048 0.9892 0.9890 0.9906
dispcorr: -0.026699498 hartree
energy: -2050.710171003388
dipole: 7.82855 -8.72248 -0.89393 7.45889 -7.22849 0.23040 -10.21797 11.41381 1.19585
magnitude: 1.51071 au
magnitude: 3.83993 debye
