program: Orca
programVersion: 5.0.2
elementType: Cl Cl O O O N C C C C C C C C C C C C C C C C C C C C C C H H H H H H H H H H H H H H H H H H H
charge: 0
multiplicity: 1
keywords: wb97x-d3
keywords: def2-TZVPP
keywords: def2/J RIJCOSX
keywords: DEFGRID2
keywords: scfconv7
keywords: smallprint printgap noloewdin
keywords: NOSOSCF
formula: C22H19Cl2NO3
InChI: InChI=1/C22H19Cl2NO3/c1-22(2)17(12-19(23)24)20(22)21(26)28-18(13-25)14-7-6-10-16(11-14)27-15-8-4-3-5-9-15/h3-12,17-18,20H,1-2H3
47 atoms
Cl -2.761368 -0.309054 0.492731
Cl -4.447864 1.206156 2.277681
O  1.569998 1.525448 -0.393092
O  2.377946 2.505616 1.444347
O  0.902601 -3.53829 0.302132
N  3.043046 0.801585 -3.253683
C  -0.608055 3.652012 -0.333613
C  -1.118661 2.360517 0.228602
C  0.152316 2.98058 0.795451
C  -0.088527 3.649199 -1.751978
C  -1.278644 4.955748 0.029751
C  -2.304448 2.284173 1.090828
C  1.470711 2.334829 0.671121
C  -3.059409 1.204869 1.25576
C  2.817172 0.907137 -0.651176
C  2.905623 -0.492783 -0.088626
C  2.93143 0.857097 -2.111893
C  1.796794 -1.331281 -0.137791
C  4.120256 -0.942826 0.404745
C  1.927111 -2.644173 0.293598
C  4.229401 -2.255133 0.845089
C  3.143662 -3.109398 0.784758
C  -0.201918 -3.366357 -0.491962
C  -1.443823 -3.492035 0.111123
C  -0.09295 -3.147978 -1.859786
C  -2.591243 -3.400678 -0.665424
C  -1.247923 -3.040831 -2.620593
C  -2.498769 -3.165866 -2.029844
H  -0.959835 1.500187 -0.410078
H  0.046109 3.470918 1.75637
H  0.748932 4.340202 -1.864832
H  -0.881534 3.98539 -2.422565
H  0.229379 2.66994 -2.100621
H  -0.6021 5.789694 -0.164563
H  -1.56927 5.015736 1.077973
H  -2.173225 5.107575 -0.577006
H  -2.590875 3.169507 1.645972
H  3.64805 1.51319 -0.277177
H  0.85004 -0.964235 -0.513816
H  4.975177 -0.279718 0.442507
H  5.172002 -2.61812 1.232813
H  3.2297 -4.135836 1.118756
H  -1.511094 -3.667511 1.177466
H  0.87811 -3.064223 -2.332308
H  -3.56054 -3.506518 -0.195501
H  -1.165497 -2.86603 -3.685557
H  -3.395009 -3.085119 -2.630669
elementType: Cl O N C H
totalener: -2050.68355128 hartree
nucrepener: 2885.94125107 hartree
electener: -4936.62480235 hartree
oneelecener: -8547.19735615 hartree
twoeener: 3610.57255380 hartree
cpcmener: -0.03108213 hartree
kineticenergy: 2044.46570414 hartree
xcener: -151.865396299524 hartree
chargesum: -0.0000000
charge: -0.054645 -0.062917 -0.282085 -0.439015 -0.321751 -0.088510 0.104801 0.027079 -0.082439 -0.264731 -0.282410 -0.207782 0.402560 0.049573 0.375587 0.037413 -0.229272 -0.215352 -0.224400 0.304140 -0.102473 -0.244500 0.312119 -0.250756 -0.201956 -0.176954 -0.142546 -0.145121 0.088350 0.097348 0.103097 0.097174 0.089330 0.100409 0.092783 0.102797 0.126600 0.139309 0.135053 0.144512 0.157443 0.147203 0.145304 0.157520 0.163878 0.159582 0.158650
qa: -0.0546 -0.0629 -0.2821 -0.4390 -0.3218 -0.0885 0.1048 0.0271 -0.0824 -0.2647 -0.2824 -0.2078 0.4026 0.0496 0.3756 0.0374 -0.2293 -0.2154 -0.2244 0.3041 -0.1025 -0.2445 0.3121 -0.2508 -0.2020 -0.1770 -0.1425 -0.1451 0.0884 0.0973 0.1031 0.0972 0.0893 0.1004 0.0928 0.1028 0.1266 0.1393 0.1351 0.1445 0.1574 0.1472 0.1453 0.1575 0.1639 0.1596 0.1587
va: 1.2897 1.2434 2.1144 2.0738 2.0947 3.1056 3.7331 3.8588 3.8309 3.9119 3.9209 3.8896 4.1967 4.2175 3.7344 3.6886 4.0663 3.9519 3.9899 3.7290 3.8948 3.9976 3.6318 3.9457 3.9272 3.8188 3.8888 3.8619 1.0252 1.0284 0.9997 1.0008 1.0101 1.0003 1.0057 0.9998 1.0228 1.0286 1.0173 1.0021 0.9896 1.0071 1.0096 0.9963 0.9912 0.9897 0.9886
dispcorr: -0.026623955 hartree
energy: -2050.710175239429
dipole: 12.01062 -12.51678 -0.50616 10.38490 -9.55519 0.82971 -11.55891 11.89887 0.33996
magnitude: 1.02965 au
magnitude: 2.61717 debye
