program: Orca
programVersion: 5.0.2
elementType: Cl Cl O O O N C C C C C C C C C C C C C C C C C C C C C C H H H H H H H H H H H H H H H H H H H
charge: 0
multiplicity: 1
keywords: wb97x-d3
keywords: def2-TZVPP
keywords: def2/J RIJCOSX
keywords: DEFGRID2
keywords: scfconv7
keywords: smallprint printgap noloewdin
keywords: NOSOSCF
formula: C22H19Cl2NO3
InChI: InChI=1/C22H19Cl2NO3/c1-22(2)17(12-19(23)24)20(22)21(26)28-18(13-25)14-7-6-10-16(11-14)27-15-8-4-3-5-9-15/h3-12,17-18,20H,1-2H3
47 atoms
Cl -1.015765 2.047368 -3.687139
Cl -3.625449 3.275872 -3.740205
O  0.920792 1.508616 0.73301
O  -0.793825 0.962389 2.052921
O  -0.017837 -4.284462 0.588682
N  4.148455 0.840286 0.804737
C  -0.390465 4.203196 0.292199
C  -0.811241 3.260851 -0.79404
C  -1.001282 2.869091 0.669007
C  1.085425 4.481215 0.455107
C  -1.239162 5.411784 0.611841
C  -2.008065 3.467266 -1.615915
C  -0.306939 1.698793 1.233177
C  -2.183084 2.991192 -2.842685
C  1.606056 0.325541 1.115864
C  1.195771 -0.846212 0.255999
C  3.027467 0.630325 0.93815
C  0.795936 -2.026614 0.8633
C  1.208603 -0.725255 -1.129448
C  0.428274 -3.107596 0.069102
C  0.819946 -1.804572 -1.905424
C  0.437772 -2.999379 -1.314325
C  0.478546 -4.767824 1.769735
C  1.836932 -4.754667 2.062853
C  -0.431158 -5.341156 2.646563
C  2.276065 -5.314252 3.254037
C  0.024427 -5.908309 3.827972
C  1.376549 -5.891633 4.140667
H  0.009397 2.759128 -1.292094
H  -2.018687 2.931085 1.03783
H  1.726216 3.704138 0.047088
H  1.343676 4.619364 1.506554
H  1.33316 5.407088 -0.067197
H  -2.308518 5.203561 0.609852
H  -1.050724 6.211284 -0.106994
H  -0.986647 5.792366 1.602895
H  -2.826774 4.037671 -1.193996
H  1.451266 0.097786 2.174991
H  0.768981 -2.094204 1.944175
H  1.521375 0.196593 -1.603985
H  0.824601 -1.72251 -2.984253
H  0.142269 -3.845269 -1.922129
H  2.550784 -4.319897 1.374052
H  -1.485712 -5.348763 2.400386
H  3.33365 -5.302659 3.484469
H  -0.686156 -6.359634 4.508386
H  1.728098 -6.329857 5.065384
elementType: Cl O N C H
totalener: -2050.68379767 hartree
nucrepener: 2749.81710080 hartree
electener: -4800.50089848 hartree
oneelecener: -8274.83697723 hartree
twoeener: 3474.33607875 hartree
cpcmener: -0.03175857 hartree
kineticenergy: 2044.47251720 hartree
xcener: -151.864102500161 hartree
chargesum: 0.0000000
charge: -0.058086 -0.059209 -0.273379 -0.439196 -0.324274 -0.085386 0.096358 0.027187 -0.071860 -0.259797 -0.279926 -0.206107 0.393615 0.049535 0.371154 0.030588 -0.228689 -0.181762 -0.223577 0.270283 -0.130586 -0.222257 0.285817 -0.197285 -0.249657 -0.139555 -0.119447 -0.185865 0.085249 0.096492 0.090990 0.101924 0.095960 0.093154 0.102962 0.099690 0.127604 0.136273 0.145276 0.150750 0.157193 0.148483 0.157517 0.146402 0.159395 0.158130 0.157924
qa: -0.0581 -0.0592 -0.2734 -0.4392 -0.3243 -0.0854 0.0964 0.0272 -0.0719 -0.2598 -0.2799 -0.2061 0.3936 0.0495 0.3712 0.0306 -0.2287 -0.1818 -0.2236 0.2703 -0.1306 -0.2223 0.2858 -0.1973 -0.2497 -0.1396 -0.1194 -0.1859 0.0852 0.0965 0.0910 0.1019 0.0960 0.0932 0.1030 0.0997 0.1276 0.1363 0.1453 0.1507 0.1572 0.1485 0.1575 0.1464 0.1594 0.1581 0.1579
va: 1.2697 1.2461 2.1243 2.0745 2.0852 3.1060 3.7422 3.8659 3.8313 3.9052 3.9211 3.8992 4.2047 4.2149 3.7795 3.6117 4.0657 3.9450 3.9587 3.7432 3.9272 4.0114 3.6909 3.9187 4.0127 3.8878 3.8822 3.9078 1.0278 1.0280 1.0117 1.0004 1.0003 1.0058 0.9997 1.0006 1.0220 1.0221 1.0078 1.0079 0.9911 1.0053 0.9965 1.0080 0.9901 0.9891 0.9905
dispcorr: -0.024555612 hartree
energy: -2050.708353284633
dipole: 11.30938 -11.99976 -0.69038 -2.14213 2.81737 0.67525 25.80001 -25.27179 0.52822
magnitude: 1.10073 au
magnitude: 2.79782 debye
