program: Orca
programVersion: 5.0.2
elementType: Cl Cl O O O N C C C C C C C C C C C C C C C C C C C C C C H H H H H H H H H H H H H H H H H H H
charge: 0
multiplicity: 1
keywords: wb97x-d3
keywords: def2-TZVPP
keywords: def2/J RIJCOSX
keywords: DEFGRID2
keywords: scfconv7
keywords: smallprint printgap noloewdin
keywords: NOSOSCF
formula: C22H19Cl2NO3
InChI: InChI=1/C22H19Cl2NO3/c1-22(2)17(12-19(23)24)20(22)21(26)28-18(13-25)14-7-6-10-16(11-14)27-15-8-4-3-5-9-15/h3-12,17-18,20H,1-2H3
47 atoms
Cl -2.331798 5.360786 1.25397
Cl -2.477783 6.653125 -1.318828
O  1.650437 0.918565 -0.789177
O  0.47429 1.177661 1.099657
O  1.149604 -3.870903 1.796213
N  4.912192 1.242823 -1.129669
C  -1.88281 1.474556 -0.965268
C  -1.498588 2.80652 -0.390436
C  -0.430413 1.911514 -0.990244
C  -2.348947 0.406249 -0.006559
C  -2.570366 1.39867 -2.306786
C  -1.804567 4.075376 -1.060928
C  0.571679 1.312732 -0.092656
C  -2.155396 5.200852 -0.45059
C  2.718688 0.297747 -0.071879
C  2.618167 -1.203963 -0.164453
C  3.947816 0.815955 -0.674693
C  1.945183 -1.883102 0.843966
C  3.122483 -1.896618 -1.258112
C  1.786122 -3.258121 0.758025
C  2.972119 -3.273671 -1.32142
C  2.31003 -3.963903 -0.318816
C  0.310009 -4.926805 1.557558
C  -0.590033 -4.928295 0.498646
C  0.349524 -5.981627 2.457283
C  -1.442901 -6.010423 0.338397
C  -0.518908 -7.050989 2.291512
C  -1.41247 -7.074395 1.229946
H  -1.496076 2.83987 0.692936
H  -0.053327 2.189975 -1.967771
H  -3.438645 0.42716 0.055611
H  -1.964382 0.531325 1.003125
H  -2.059771 -0.585636 -0.360015
H  -3.63833 1.597435 -2.199402
H  -2.46106 0.397633 -2.727668
H  -2.171098 2.101541 -3.037033
H  -1.727354 4.112358 -2.141215
H  2.718026 0.611635 0.97561
H  1.546516 -1.350783 1.698755
H  3.641703 -1.378469 -2.0548
H  3.380965 -3.820735 -2.160563
H  2.211684 -5.040349 -0.379674
H  -0.632422 -4.097806 -0.19525
H  1.052789 -5.962873 3.280592
H  -2.141958 -6.01463 -0.488089
H  -0.489539 -7.873434 2.99455
H  -2.082862 -7.913588 1.099491
elementType: Cl O N C H
totalener: -2050.68622949 hartree
nucrepener: 2675.63634604 hartree
electener: -4726.32257553 hartree
oneelecener: -8126.39510235 hartree
twoeener: 3400.07252682 hartree
cpcmener: -0.02952107 hartree
kineticenergy: 2044.46745940 hartree
xcener: -151.862210259001 hartree
chargesum: 0.0000000
charge: -0.054653 -0.059566 -0.274394 -0.446412 -0.326860 -0.089295 0.087327 0.030859 -0.089851 -0.269288 -0.265275 -0.204654 0.411019 0.043510 0.395180 -0.008141 -0.216050 -0.196308 -0.193501 0.238446 -0.142369 -0.167515 0.271929 -0.182012 -0.240959 -0.149533 -0.124995 -0.179477 0.079720 0.098283 0.099085 0.096513 0.100486 0.101983 0.098648 0.091240 0.129842 0.133257 0.135408 0.139892 0.161643 0.158170 0.157612 0.146298 0.159166 0.157382 0.158211
qa: -0.0547 -0.0596 -0.2744 -0.4464 -0.3269 -0.0893 0.0873 0.0309 -0.0899 -0.2693 -0.2653 -0.2047 0.4110 0.0435 0.3952 -0.0081 -0.2161 -0.1963 -0.1935 0.2384 -0.1424 -0.1675 0.2719 -0.1820 -0.2410 -0.1495 -0.1250 -0.1795 0.0797 0.0983 0.0991 0.0965 0.1005 0.1020 0.0986 0.0912 0.1298 0.1333 0.1354 0.1399 0.1616 0.1582 0.1576 0.1463 0.1592 0.1574 0.1582
va: 1.2709 1.2452 2.1274 2.0662 2.0741 3.1084 3.7362 3.8620 3.8534 3.9089 3.9082 3.9028 4.1848 4.2145 3.7313 3.7177 4.0632 4.0201 3.9897 3.7968 3.9238 3.9232 3.6976 3.8986 4.0056 3.8945 3.8904 3.9020 1.0494 1.0324 1.0006 1.0170 0.9996 1.0005 1.0012 1.0059 1.0189 1.0242 1.0302 1.0106 0.9909 0.9948 0.9960 1.0076 0.9905 0.9893 0.9902
dispcorr: -0.022915130 hartree
energy: -2050.709144619408
dipole: -3.13569 1.55055 -1.58514 -43.71688 41.51498 -2.20190 -5.74185 4.66833 -1.07352
magnitude: 2.91779 au
magnitude: 7.41642 debye
