program: Orca
programVersion: 5.0.2
elementType: Cl Cl O O O N C C C C C C C C C C C C C C C C C C C C C C H H H H H H H H H H H H H H H H H H H
charge: 0
multiplicity: 1
keywords: wb97x-d3
keywords: def2-TZVPP
keywords: def2/J RIJCOSX
keywords: DEFGRID2
keywords: scfconv7
keywords: smallprint printgap noloewdin
keywords: NOSOSCF
formula: C22H19Cl2NO3
InChI: InChI=1/C22H19Cl2NO3/c1-22(2)17(12-19(23)24)20(22)21(26)28-18(13-25)14-7-6-10-16(11-14)27-15-8-4-3-5-9-15/h3-12,17-18,20H,1-2H3
47 atoms
Cl -1.934741 5.881417 1.477475
Cl -1.154978 7.468276 -0.803401
O  1.120354 0.864161 -0.788072
O  -0.371268 0.952705 0.873119
O  0.58515 -4.343976 1.922065
N  4.256918 -0.091807 -1.092342
C  -2.144478 2.376386 -1.298918
C  -1.488579 3.42023 -0.445203
C  -0.645616 2.325692 -1.077201
C  -3.065068 1.39512 -0.616906
C  -2.584264 2.71454 -2.703039
C  -1.2831 4.797669 -0.906843
C  -0.001012 1.327831 -0.208778
C  -1.438029 5.890723 -0.17045
C  1.851037 -0.121027 -0.072224
C  1.252972 -1.501694 -0.210489
C  3.194822 -0.093233 -0.655044
C  1.173819 -2.316878 0.907146
C  0.829618 -1.959224 -1.453245
C  0.667951 -3.604795 0.781008
C  0.315408 -3.241154 -1.559989
C  0.230895 -4.072096 -0.451961
C  0.698471 -5.709923 1.842461
C  1.835721 -6.298027 1.303757
C  -0.327287 -6.483628 2.360772
C  1.938159 -7.680804 1.286918
C  -0.208423 -7.867344 2.344765
C  0.918436 -8.469777 1.804476
H  -1.660617 3.299787 0.618639
H  -0.050687 2.621909 -1.933874
H  -3.039745 0.424207 -1.115342
H  -4.08999 1.766547 -0.673269
H  -2.832632 1.242373 0.434332
H  -2.701267 1.80059 -3.288597
H  -1.877625 3.351546 -3.234281
H  -3.549905 3.223921 -2.688509
H  -0.966187 4.94381 -1.932809
H  1.947822 0.146934 0.985131
H  1.504791 -1.960015 1.875351
H  0.898765 -1.329741 -2.331288
H  -0.024933 -3.606054 -2.520101
H  -0.177666 -5.06901 -0.557239
H  2.636664 -5.684935 0.908407
H  -1.206985 -6.008431 2.776439
H  2.824322 -8.142565 0.870899
H  -1.007042 -8.474864 2.750548
H  1.005286 -9.548299 1.790051
elementType: Cl O N C H
totalener: -2050.68660456 hartree
nucrepener: 2634.07022261 hartree
electener: -4684.75682717 hartree
oneelecener: -8043.58210970 hartree
twoeener: 3358.82528254 hartree
cpcmener: -0.03172278 hartree
kineticenergy: 2044.47054769 hartree
xcener: -151.862041117828 hartree
chargesum: 0.0000000
charge: -0.054307 -0.059420 -0.284510 -0.440623 -0.327212 -0.088122 0.089384 0.031618 -0.080197 -0.265506 -0.262041 -0.198790 0.384747 0.038957 0.406742 0.023613 -0.226701 -0.218430 -0.211110 0.234593 -0.153256 -0.152714 0.229049 -0.159408 -0.214887 -0.153268 -0.136675 -0.165582 0.082654 0.097005 0.099539 0.097789 0.095482 0.098517 0.090523 0.101140 0.129454 0.140344 0.134095 0.147443 0.159461 0.157194 0.159540 0.147389 0.159013 0.158684 0.158789
qa: -0.0543 -0.0594 -0.2845 -0.4406 -0.3272 -0.0881 0.0894 0.0316 -0.0802 -0.2655 -0.2620 -0.1988 0.3847 0.0390 0.4067 0.0236 -0.2267 -0.2184 -0.2111 0.2346 -0.1533 -0.1527 0.2290 -0.1594 -0.2149 -0.1533 -0.1367 -0.1656 0.0827 0.0970 0.0995 0.0978 0.0955 0.0985 0.0905 0.1011 0.1295 0.1403 0.1341 0.1474 0.1595 0.1572 0.1595 0.1474 0.1590 0.1587 0.1588
va: 1.2713 1.2452 2.1244 2.0744 2.0686 3.1128 3.7287 3.8800 3.8531 3.9038 3.9093 3.8959 4.1905 4.2131 3.7202 3.6415 4.0777 4.0750 3.9589 3.7886 3.9341 3.8831 3.7307 3.9172 3.9955 3.8958 3.8892 3.8899 1.0454 1.0339 0.9999 1.0003 1.0187 1.0015 1.0055 1.0011 1.0185 1.0196 1.0185 1.0127 0.9915 0.9967 0.9950 1.0057 0.9904 0.9892 0.9899
dispcorr: -0.022739684 hartree
energy: -2050.709344243056
dipole: -6.66999 5.07895 -1.59103 -42.62865 41.25039 -1.37827 -9.26671 8.16351 -1.10320
magnitude: 2.37657 au
magnitude: 6.04075 debye
